{"text_format":"3","workbook":"xlsx","n_sheets":15,"sheets":["Calendrier","Qui","Comment","Manche_1","Manche_2","Manche_3","Manche_4","Manche_5","Manche_6","Manche_7","Challenge_1","Challenge_2","Challenge_GJ","Champions_AN","A Ameliorer"],"not_rendered":{"images":3,"macros":1,"defined_names":33},"read":"whole","date_system":"1900"}

{"sheet":"Calendrier","index":0,"n_rows":204,"n_cols":23,"rows_kept":204,"merged":[[0,0,0,7],[1,0,1,2],[1,4,1,7],[3,0,3,2],[3,5,3,6],[10,0,10,2],[10,5,10,6],[10,11,10,12],[10,13,10,14],[17,0,17,2],[17,5,17,6],[17,13,17,14],[21,4,21,7],[23,4,23,7],[24,0,24,2],[24,5,24,6],[24,13,24,14],[31,0,31,2],[31,3,37,5],[31,6,37,7],[38,0,38,7],[39,0,39,2],[39,5,39,6],[46,0,46,2],[46,5,46,6],[53,0,53,2],[53,5,53,6],[60,0,60,2],[60,5,60,6],[67,0,67,2],[67,3,72,3],[67,5,67,6],[74,0,74,2],[74,5,74,6],[81,0,81,2],[81,5,81,6],[87,0,87,2],[87,5,87,6],[89,0,89,7],[91,0,91,1],[91,2,91,6],[92,0,92,1],[92,2,92,6]]}
["GRAND JEU NEUCHATELOIS",{"$nulls":8},"mettre votre\nclub en évidence",null,2023,2022,2021,2020,2019,2018,2017,2016,2015,2014,2013,2012]
["Entraînements",{"$nulls":3},{"$f":"CONCATENATE(\"Compétitions \",YEAR(B6))","v":"Compétitions 2024"}]
[]
["Challenge 80ème",{"$nulls":3},"Jeu :","L'Epi",null,"Marquage",{"$nulls":3},"La Chaux-de-fonds",null,null,"Evologia","La  Vue-des-Alpes","La Chaux-de-Fonds","L'Epi","La  Vue-des-Alpes","La Chaux-de-Fonds","La Chaux-de-Fonds","L'Epi","La  Vue-des-Alpes"]
[]
["Lundi","2024-03-11","Le Locle",null,"Lundi",{"$f":"B6+7","v":"2024-03-18"},"Le Locle","L'Epi"]
{"$rows_left_out":90}
{"sheet":"Qui","index":1,"n_rows":516,"n_cols":16,"rows_kept":516,"hidden":true,"merged":[[196,8,196,9],[199,8,199,9],[413,2,416,2]]}
{"$rows_empty":195}
["Inventaire des  Club, Jeux, choix des couleurs"]
["Club Texte","Pour lui-même","Pour lui-même","Choix de la couleur club \npour chque club","Couleur club texte","Duplicata Colonne A\ntechnique",null,null,"Lien entre n° couleur et texte\n==> mise en forme conditionnelle"]
[{"$nulls":4},"Non modifiable","Non modifiable","Non modifiable",null,"Non modifiable","Non modifiable"]
[]
["Les_Clubs","Les_Jeux","Les_compétitions","CLUB n°","Couleur","Copie_Les_Clubs","Nb joueurs",null,"Définition des couleurs"]
{"$rows_left_out":107}
{"sheet":"Comment","index":2,"n_rows":181,"n_cols":6,"rows_kept":181,"hidden":true}
["Onglet Calendrier"]
[]
["Choisir la compétition dans la liste déroulante "]
["Choisir le Jeu (pont) dans la liste déroulante"]
["Remplir la première date de l'entrainement et les suivantes se mettent automatiquement"]
["Choisir les clubs marqueurs (Un décompte du nombre de marquages ce fait automatiquement)"]
{"$rows_left_out":121}
{"sheet":"Manche_1","index":3,"n_rows":74,"n_cols":21,"rows_kept":74,"hidden":true,"merged":[[0,0,0,17],[1,0,1,17],[2,0,2,1],[2,15,2,17],[3,15,3,17],[60,1,60,2],[60,15,60,16],[67,1,67,2],[68,12,68,17],[70,1,70,17],[71,1,71,17],[72,1,72,17],[73,1,73,17]]}
["Association intercantonale \ndes joueurs de boules\nGrand Jeu Neuchâtelois"]
[{"$f":"CONCATENATE(\"Championnat grand jeu neuchâtelois \",YEAR(Calendrier!B6))","v":"Championnat grand jeu neuchâtelois 2024"}]
["Classement général individuel",null,"Manches",{"$f":"Calendrier!F40","v":"Grand-Sommartel"},{"$f":"Calendrier!F47","v":"Le Locle"},{"$f":"Calendrier!F54","v":"Evologia"},{"$f":"Calendrier!F61","v":"La  Vue-des-Alpes"},{"$f":"Calendrier!F68","v":"L'Epi"},{"$f":"Calendrier!F75","v":"La  Chaux-de-Fonds"},{"$f":"Calendrier!F82","v":"00:00:00"},null,null,{"$f":"CONCATENATE(\"Général\",CHAR(10),\"les \",Qui!$A$402,\" meilleurs\")","v":"Général\nles 5 meilleurs"},null,null,{"$f":"CONCATENATE(\"Classement de la manche\",CHAR(10),Calendrier!F40,CHAR(10),\"du\",TEXT(Calendrier!F42,\" jj.mm\"),\" au\",TEXT(Calendrier!F45,\" jj.mm.aaaa\"))","v":"Classement de la manche\nGrand-Sommartel\ndu 26.08 au 29.08.2024"},{"$nulls":4},{"$f":"CONCATENATE(TEXT(Calendrier!F42,\" jj.mm\"),\" au\",TEXT(Calendrier!F45,\" jj.mm.aaaa\"))","v":" 26.08 au 29.08.2024"}]
[{"$nulls":3},1,2,3,4,5,6,7,8,9,{"$nulls":3},{"$f":"CONCATENATE(\"Champion de jeu : \",CHAR(10),P5,\" \",Q5)","v":"Champion de jeu : \nBart Fabien"}]
[1,"Bart","Fabien",118,0,0,0,0,0,0,null,null,{"$f":"SUM(D5:L5*(D5:L5>=LARGE(D5:L5,Qui!$A$402)))","v":118},{"$f":"IFERROR((VLOOKUP(CONCATENATE(B5,C5),Qui!$D$301:$F$356,3,)),0)","v":3},1,"Bart","Fabien",118,{"$f":"IFERROR((VLOOKUP(CONCATENATE(P5,Q5),Qui!$D$301:$F$356,3,0)),0)","v":3}]
[2,"Tynowski","Lucien",{"v":110.2,"d":"110"},0,0,0,0,0,0,null,null,{"$f":"SUM(D6:L6*(D6:L6>=LARGE(D6:L6,Qui!$A$402)))","v":{"v":110.2,"d":"110"}},{"$f":"IFERROR((VLOOKUP(CONCATENATE(B6,C6),Qui!$D$301:$F$356,3,)),0)","v":3},2,"Tynowski","Lucien",{"v":110.2,"d":"110"},{"$f":"IFERROR((VLOOKUP(CONCATENATE(P6,Q6),Qui!$D$301:$F$356,3,0)),0)","v":3}]
{"$rows_left_out":69}
{"sheet":"Manche_2","index":4,"n_rows":74,"n_cols":21,"rows_kept":74,"hidden":true,"merged":[[0,0,0,17],[1,0,1,17],[2,0,2,1],[2,15,2,17],[3,15,3,17],[60,1,60,2],[60,15,60,16],[67,1,67,2],[68,12,68,17],[70,1,70,17],[71,1,71,17],[72,1,72,17],[73,1,73,17]]}
["Association intercantonale \ndes joueurs de boules\nGrand Jeu Neuchâtelois"]
[{"$f":"CONCATENATE(\"Championnat grand jeu neuchâtelois \",YEAR(Calendrier!B6))","v":"Championnat grand jeu neuchâtelois 2024"}]
["Classement général individuel",null,"Manches",{"$f":"Calendrier!F40","v":"Grand-Sommartel"},{"$f":"Calendrier!F47","v":"Le Locle"},{"$f":"Calendrier!F54","v":"Evologia"},{"$f":"Calendrier!F61","v":"La  Vue-des-Alpes"},{"$f":"Calendrier!F68","v":"L'Epi"},{"$f":"Calendrier!F75","v":"La  Chaux-de-Fonds"},{"$f":"Calendrier!F82","v":"00:00:00"},null,null,{"$f":"CONCATENATE(\"Général\",CHAR(10),\"les \",Qui!$A$402,\" meilleurs\")","v":"Général\nles 5 meilleurs"},null,null,{"$f":"CONCATENATE(\"Classement de la manche\",CHAR(10),Calendrier!F47,CHAR(10),\"du\",TEXT(Calendrier!F49,\" jj.mm\"),\" au\",TEXT(Calendrier!F52,\" jj.mm.aaaa\"))","v":"Classement de la manche\nLe Locle\ndu 09.09 au 12.09.2024"},{"$nulls":4},{"$f":"CONCATENATE(TEXT(Calendrier!F49,\" jj.mm\"),\" au\",TEXT(Calendrier!F52,\" jj.mm.aaaa\"))","v":" 09.09 au 12.09.2024"}]
[{"$nulls":3},1,2,3,4,5,6,7,8,9,{"$nulls":3},{"$f":"CONCATENATE(\"Champion de jeu : \",CHAR(10),P5,\" \",Q5)","v":"Champion de jeu : \nBart Fabien"}]
[1,"Bart","Fabien",118,0,0,0,0,0,0,null,null,{"$f":"SUM(D5:L5*(D5:L5>=LARGE(D5:L5,Qui!$A$402)))","v":118},{"$f":"IFERROR((VLOOKUP(CONCATENATE(B5,C5),Qui!$D$301:$F$356,3,)),0)","v":3},1,"Bart","Fabien",109,{"$f":"IFERROR((VLOOKUP(CONCATENATE(P5,Q5),Qui!$D$301:$F$356,3,0)),0)","v":3}]
[2,"Tynowski","Lucien",{"v":110.2,"d":"110"},0,0,0,0,0,0,null,null,{"$f":"SUM(D6:L6*(D6:L6>=LARGE(D6:L6,Qui!$A$402)))","v":{"v":110.2,"d":"110"}},{"$f":"IFERROR((VLOOKUP(CONCATENATE(B6,C6),Qui!$D$301:$F$356,3,)),0)","v":3},2,"Tynowski","Lucien",117,{"$f":"IFERROR((VLOOKUP(CONCATENATE(P6,Q6),Qui!$D$301:$F$356,3,0)),0)","v":3}]
{"$rows_left_out":69}
{"sheet":"Manche_3","index":5,"n_rows":74,"n_cols":21,"rows_kept":74,"hidden":true,"merged":[[0,0,0,17],[1,0,1,17],[2,0,2,1],[2,15,2,17],[3,15,3,17],[60,1,60,2],[60,15,60,16],[67,1,67,2],[68,12,68,17],[70,1,70,17],[71,1,71,17],[72,1,72,17],[73,1,73,17]]}
["Association intercantonale \ndes joueurs de boules\nGrand Jeu Neuchâtelois"]
[{"$f":"CONCATENATE(\"Championnat grand jeu neuchâtelois \",YEAR(Calendrier!B6))","v":"Championnat grand jeu neuchâtelois 2024"}]
["Classement général individuel",null,"Manches",{"$f":"Calendrier!F40","v":"Grand-Sommartel"},{"$f":"Calendrier!F47","v":"Le Locle"},{"$f":"Calendrier!F54","v":"Evologia"},{"$f":"Calendrier!F61","v":"La  Vue-des-Alpes"},{"$f":"Calendrier!F68","v":"L'Epi"},{"$f":"Calendrier!F75","v":"La  Chaux-de-Fonds"},{"$f":"Calendrier!F82","v":"00:00:00"},null,null,{"$f":"CONCATENATE(\"Général\",CHAR(10),\"les \",Qui!$A$402,\" meilleurs\")","v":"Général\nles 5 meilleurs"},null,null,{"$f":"CONCATENATE(\"Classement de la manche\",CHAR(10),Calendrier!F54,CHAR(10),\"du\",TEXT(Calendrier!F56,\" jj.mm\"),\" au\",TEXT(Calendrier!F59,\" jj.mm.aaaa\"))","v":"Classement de la manche\nEvologia\ndu 30.09 au 03.10.2024"},{"$nulls":4},{"$f":"CONCATENATE(TEXT(Calendrier!F56,\" jj.mm\"),\" au\",TEXT(Calendrier!F59,\" jj.mm.aaaa\"))","v":" 30.09 au 03.10.2024"}]
[{"$nulls":3},1,2,3,4,5,6,7,8,9,{"$nulls":3},{"$f":"CONCATENATE(\"Champion de jeu : \",CHAR(10),P5,\" \",Q5)","v":"Champion de jeu : \n "}]
[1,{"$nulls":11},{"$f":"SUM(D5:L5*(D5:L5>=LARGE(D5:L5,Qui!$A$402)))","v":{"$error":"#NUM!"}},{"$f":"IFERROR((VLOOKUP(CONCATENATE(B5,C5),Qui!$D$301:$F$356,3,)),0)","v":0},1,null,null,0,{"$f":"IFERROR((VLOOKUP(CONCATENATE(P5,Q5),Qui!$D$301:$F$356,3,0)),0)","v":0}]
[2,{"$nulls":11},{"$f":"SUM(D6:L6*(D6:L6>=LARGE(D6:L6,Qui!$A$402)))","v":{"$error":"#NUM!"}},{"$f":"IFERROR((VLOOKUP(CONCATENATE(B6,C6),Qui!$D$301:$F$356,3,)),0)","v":0},2,null,null,0,{"$f":"IFERROR((VLOOKUP(CONCATENATE(P6,Q6),Qui!$D$301:$F$356,3,0)),0)","v":0}]
{"$rows_left_out":69}
{"sheet":"Manche_4","index":6,"n_rows":74,"n_cols":21,"rows_kept":74,"hidden":true,"merged":[[0,0,0,17],[1,0,1,17],[2,0,2,1],[2,15,2,17],[3,15,3,17],[60,1,60,2],[60,15,60,16],[67,1,67,2],[68,12,68,17],[70,1,70,17],[71,1,71,17],[72,1,72,17],[73,1,73,17]]}
["Association intercantonale \ndes joueurs de boules\nGrand Jeu Neuchâtelois"]
[{"$f":"CONCATENATE(\"Championnat grand jeu neuchâtelois \",YEAR(Calendrier!B6))","v":"Championnat grand jeu neuchâtelois 2024"}]
["Classement général individuel",null,"Manches",{"$f":"Calendrier!F40","v":"Grand-Sommartel"},{"$f":"Calendrier!F47","v":"Le Locle"},{"$f":"Calendrier!F54","v":"Evologia"},{"$f":"Calendrier!F61","v":"La  Vue-des-Alpes"},{"$f":"Calendrier!F68","v":"L'Epi"},{"$f":"Calendrier!F75","v":"La  Chaux-de-Fonds"},{"$f":"Calendrier!F82","v":"00:00:00"},null,null,{"$f":"CONCATENATE(\"Général\",CHAR(10),\"les \",Qui!$A$402,\" meilleurs\")","v":"Général\nles 5 meilleurs"},null,null,{"$f":"CONCATENATE(\"Classement de la manche\",CHAR(10),Calendrier!F61,CHAR(10),\"du\",TEXT(Calendrier!F63,\" jj.mm\"),\" au\",TEXT(Calendrier!F66,\" jj.mm.aaaa\"))","v":"Classement de la manche\nLa  Vue-des-Alpes\ndu 28.10 au 31.10.2024"},{"$nulls":4},{"$f":"CONCATENATE(TEXT(Calendrier!F63,\" jj.mm\"),\" au\",TEXT(Calendrier!F66,\" jj.mm.aaaa\"))","v":" 28.10 au 31.10.2024"}]
[{"$nulls":3},1,2,3,4,5,6,7,8,9,{"$nulls":3},{"$f":"CONCATENATE(\"Champion de jeu : \",CHAR(10),P5,\" \",Q5)","v":"Champion de jeu : \n "}]
[1,{"$nulls":11},{"$f":"SUM(D5:L5*(D5:L5>=LARGE(D5:L5,Qui!$A$402)))","v":{"$error":"#NUM!"}},{"$f":"IFERROR((VLOOKUP(CONCATENATE(B5,C5),Qui!$D$301:$F$356,3,)),0)","v":0},1,null,null,0,{"$f":"IFERROR((VLOOKUP(CONCATENATE(P5,Q5),Qui!$D$301:$F$356,3,0)),0)","v":0}]
[2,{"$nulls":11},{"$f":"SUM(D6:L6*(D6:L6>=LARGE(D6:L6,Qui!$A$402)))","v":{"$error":"#NUM!"}},{"$f":"IFERROR((VLOOKUP(CONCATENATE(B6,C6),Qui!$D$301:$F$356,3,)),0)","v":0},2,null,null,0,{"$f":"IFERROR((VLOOKUP(CONCATENATE(P6,Q6),Qui!$D$301:$F$356,3,0)),0)","v":0}]
{"$rows_left_out":69}
{"sheet":"Manche_5","index":7,"n_rows":74,"n_cols":21,"rows_kept":74,"hidden":true,"merged":[[0,0,0,17],[1,0,1,17],[2,0,2,1],[2,15,2,17],[3,15,3,17],[60,1,60,2],[60,15,60,16],[67,1,67,2],[68,12,68,17],[70,1,70,17],[71,1,71,17],[72,1,72,17],[73,1,73,17]]}
["Association intercantonale \ndes joueurs de boules\nGrand Jeu Neuchâtelois"]
[{"$f":"CONCATENATE(\"Championnat grand jeu neuchâtelois \",YEAR(Calendrier!B6))","v":"Championnat grand jeu neuchâtelois 2024"}]
["Classement général individuel",null,"Manches",{"$f":"Calendrier!F40","v":"Grand-Sommartel"},{"$f":"Calendrier!F47","v":"Le Locle"},{"$f":"Calendrier!F54","v":"Evologia"},{"$f":"Calendrier!F61","v":"La  Vue-des-Alpes"},{"$f":"Calendrier!F68","v":"L'Epi"},{"$f":"Calendrier!F75","v":"La  Chaux-de-Fonds"},{"$f":"Calendrier!F82","v":"00:00:00"},null,null,{"$f":"CONCATENATE(\"Général\",CHAR(10),\"les \",Qui!$A$402,\" meilleurs\")","v":"Général\nles 5 meilleurs"},null,null,{"$f":"CONCATENATE(\"Classement de la manche\",CHAR(10),Calendrier!F68,CHAR(10),\"du\",TEXT(Calendrier!F70,\" jj.mm\"),\" au\",TEXT(Calendrier!F73,\" jj.mm.aaaa\"))","v":"Classement de la manche\nL'Epi\ndu 11.11 au 14.11.2024"},{"$nulls":4},{"$f":"CONCATENATE(TEXT(Calendrier!F70,\" jj.mm\"),\" au\",TEXT(Calendrier!F73,\" jj.mm.aaaa\"))","v":" 11.11 au 14.11.2024"}]
[{"$nulls":3},1,2,3,4,5,6,7,8,9,{"$nulls":3},{"$f":"CONCATENATE(\"Champion de jeu : \",CHAR(10),P5,\" \",Q5)","v":"Champion de jeu : \n "}]
[1,{"$nulls":11},{"$f":"SUM(D5:L5*(D5:L5>=LARGE(D5:L5,Qui!$A$402)))","v":{"$error":"#NUM!"}},{"$f":"IFERROR((VLOOKUP(CONCATENATE(B5,C5),Qui!$D$301:$F$356,3,)),0)","v":0},1,null,null,0,{"$f":"IFERROR((VLOOKUP(CONCATENATE(P5,Q5),Qui!$D$301:$F$356,3,0)),0)","v":0}]
[2,{"$nulls":11},{"$f":"SUM(D6:L6*(D6:L6>=LARGE(D6:L6,Qui!$A$402)))","v":{"$error":"#NUM!"}},{"$f":"IFERROR((VLOOKUP(CONCATENATE(B6,C6),Qui!$D$301:$F$356,3,)),0)","v":0},2,null,null,0,{"$f":"IFERROR((VLOOKUP(CONCATENATE(P6,Q6),Qui!$D$301:$F$356,3,0)),0)","v":0}]
{"$rows_left_out":69}
{"sheet":"Manche_6","index":8,"n_rows":74,"n_cols":21,"rows_kept":74,"hidden":true,"merged":[[0,0,0,17],[1,0,1,17],[2,0,2,1],[2,15,2,17],[3,15,3,17],[60,1,60,2],[60,15,60,16],[67,1,67,2],[68,12,68,17],[70,1,70,17],[71,1,71,17],[72,1,72,17],[73,1,73,17]]}
["Association intercantonale \ndes joueurs de boules\nGrand Jeu Neuchâtelois"]
[{"$f":"CONCATENATE(\"Championnat grand jeu neuchâtelois \",YEAR(Calendrier!B6))","v":"Championnat grand jeu neuchâtelois 2024"}]
["Classement général individuel",null,"Manches",{"$f":"Calendrier!F40","v":"Grand-Sommartel"},{"$f":"Calendrier!F47","v":"Le Locle"},{"$f":"Calendrier!F54","v":"Evologia"},{"$f":"Calendrier!F61","v":"La  Vue-des-Alpes"},{"$f":"Calendrier!F68","v":"L'Epi"},{"$f":"Calendrier!F75","v":"La  Chaux-de-Fonds"},{"$f":"Calendrier!F82","v":"00:00:00"},null,null,{"$f":"CONCATENATE(\"Général\",CHAR(10),\"les \",Qui!$A$402,\" meilleurs\")","v":"Général\nles 5 meilleurs"},null,null,{"$f":"CONCATENATE(\"Classement de la manche\",CHAR(10),Calendrier!F75,CHAR(10),\"du\",TEXT(Calendrier!F77,\" jj.mm\"),\" au\",TEXT(Calendrier!F80,\" jj.mm.aaaa\"))","v":"Classement de la manche\nLa  Chaux-de-Fonds\ndu 25.11 au 28.11.2024"},{"$nulls":4},{"$f":"CONCATENATE(TEXT(Calendrier!F77,\" jj.mm\"),\" au\",TEXT(Calendrier!F80,\" jj.mm.aaaa\"))","v":" 25.11 au 28.11.2024"}]
[{"$nulls":3},1,2,3,4,5,6,7,8,9,{"$nulls":3},{"$f":"CONCATENATE(\"Champion de jeu : \",CHAR(10),P5,\" \",Q5)","v":"Champion de jeu : \n "}]
[1,{"$nulls":11},{"$f":"SUM(D5:L5*(D5:L5>=LARGE(D5:L5,Qui!$A$402)))","v":{"$error":"#NUM!"}},{"$f":"IFERROR((VLOOKUP(CONCATENATE(B5,C5),Qui!$D$301:$F$356,3,)),0)","v":0},1,{"$nulls":3},{"$f":"IFERROR((VLOOKUP(CONCATENATE(P5,Q5),Qui!$D$301:$F$356,3,0)),0)","v":0}]
[2,{"$nulls":11},{"$f":"SUM(D6:L6*(D6:L6>=LARGE(D6:L6,Qui!$A$402)))","v":{"$error":"#NUM!"}},{"$f":"IFERROR((VLOOKUP(CONCATENATE(B6,C6),Qui!$D$301:$F$356,3,)),0)","v":0},2,{"$nulls":3},{"$f":"IFERROR((VLOOKUP(CONCATENATE(P6,Q6),Qui!$D$301:$F$356,3,0)),0)","v":0}]
{"$rows_left_out":69}
{"sheet":"Manche_7","index":9,"n_rows":74,"n_cols":19,"rows_kept":74,"hidden":true,"merged":[[0,0,0,17],[1,0,1,17],[2,0,2,1],[2,15,2,17],[3,15,3,17],[60,1,60,2],[60,15,60,16],[67,1,67,2],[68,12,68,17],[70,1,70,17],[71,1,71,17],[72,1,72,17],[73,1,73,17]]}
["Association intercantonale \ndes joueurs de boules\nGrand Jeu Neuchâtelois"]
[{"$f":"CONCATENATE(\"Championnat grand jeu neuchâtelois \",YEAR(Calendrier!B6))","v":"Championnat grand jeu neuchâtelois 2024"}]
["Classement général individuel",null,"Manches",{"$f":"Calendrier!F40","v":"Grand-Sommartel"},{"$f":"Calendrier!F47","v":"Le Locle"},{"$f":"Calendrier!F54","v":"Evologia"},{"$f":"Calendrier!F61","v":"La  Vue-des-Alpes"},{"$f":"Calendrier!F68","v":"L'Epi"},{"$f":"Calendrier!F75","v":"La  Chaux-de-Fonds"},{"$f":"Calendrier!F82","v":"00:00:00"},null,null,{"$f":"CONCATENATE(\"Général\",CHAR(10),\"les \",Qui!$A$402,\" meilleurs\")","v":"Général\nles 5 meilleurs"},null,null,{"$f":"CONCATENATE(\"Classement de la manche\",CHAR(10),Calendrier!F82,CHAR(10),\"du \",TEXT(Calendrier!F84,\" jj.mm\"),\" au \",TEXT(Calendrier!F87,\" jj.mm.aaaa\"))","v":"Classement de la manche\n\ndu  07.01 au  10.01.1900"}]
[{"$nulls":3},1,2,3,4,5,6,7,8,9,{"$nulls":3},{"$f":"CONCATENATE(\"Champion de jeu : \",CHAR(10),P5,\" \",Q5)","v":"Champion de jeu : \n "}]
[1,{"$nulls":11},{"$f":"SUM(D5:L5*(D5:L5>=LARGE(D5:L5,Qui!$A$402)))","v":{"$error":"#NUM!"}},{"$f":"IFERROR((VLOOKUP(CONCATENATE(B5,C5),Qui!$D$301:$F$356,3,)),0)","v":0},1,null,null,0,{"$f":"IFERROR((VLOOKUP(CONCATENATE(P5,Q5),Qui!$D$301:$F$356,3,0)),0)","v":0}]
[2,{"$nulls":11},{"$f":"SUM(D6:L6*(D6:L6>=LARGE(D6:L6,Qui!$A$402)))","v":{"$error":"#NUM!"}},{"$f":"IFERROR((VLOOKUP(CONCATENATE(B6,C6),Qui!$D$301:$F$356,3,)),0)","v":0},2,null,null,0,{"$f":"IFERROR((VLOOKUP(CONCATENATE(P6,Q6),Qui!$D$301:$F$356,3,0)),0)","v":0}]
{"$rows_left_out":69}
{"sheet":"Challenge_1","index":10,"n_rows":59,"n_cols":27,"rows_kept":59,"hidden":true,"merged":[[0,0,0,9],[1,0,1,9],[3,16,3,18],[3,21,3,26],[56,7,56,8]]}
["Association intercantonale\n des joueurs de boules,\nGrand Jeu Neuchâtelois\n"]
[{"$f":"CONCATENATE(Calendrier!A4,\"      Jeu : \",(Calendrier!F4))","v":"Challenge 80ème      Jeu : L'Epi"}]
[{"$nulls":9},{"$f":"CONCATENATE(\"du \",TEXT(Calendrier!F6,\" jj.mm\"),\" au \",TEXT(Calendrier!F9,\" jj.mm.aaaa\"))","v":"du  18.03 au  21.03.2024"}]
["Classement par équipes",{"$nulls":6},"Classement individuel",{"$nulls":4},"Equipe",{"$nulls":3},"Equipes possibles",{"$nulls":4},"Equipes triées"]
[{"$nulls":16},"N°","Nom","Total équipe",null,null,"Rang","Nom","Prénom","Résultat","TotEquipe","Equipe"]
["1er",{"$f":"IF($D11,(INDEX($Q$6:$S$20,MATCH($AA6,$Q$6:$Q$20,0),2)),0)","v":"L'Epi I"},null,null,{"$f":"VLOOKUP(B6,Qui!$A$201:$D$204,4)","v":4},1,null,"Reichen","Sylvain",115,{"$f":"IFERROR((VLOOKUP(CONCATENATE(H6,I6),Qui!$D$301:$F$356,3,0)),0)","v":4},null,"E1",{"$nulls":3},"C1","La Chaux-de-Fonds  I",{"$f":"SUMIF($M$6:$M$40,\"=\"&$Q6,$J$6:$J$40)","v":300},null,null,1,"Reichen","Sylvain",115,{"$f":"IF($AA6<>\"\",(IF($Y6,(INDEX($Q$6:$S$20,MATCH($AA6,$Q$6:$Q$20,0),3)),0)),0)","v":414},"E1"]
{"$rows_left_out":54}
{"sheet":"Challenge_2","index":11,"n_rows":59,"n_cols":27,"rows_kept":59,"hidden":true,"merged":[[0,0,0,9],[1,0,1,9],[3,16,3,18],[3,21,3,26],[4,1,4,2],[56,7,56,8]]}
["Association intercantonale\n des joueurs de boules,\nGrand Jeu Neuchâtelois\n"]
[{"$f":"CONCATENATE(Calendrier!A25,\"      Jeu : \",(Calendrier!F25))","v":"Challenge -  ÉTÉ (ex Impartial)      Jeu : "}]
[{"$nulls":9},{"$f":"CONCATENATE(\"du \",TEXT(Calendrier!F27,\" jj.mm\"),\" au \",TEXT(Calendrier!F30,\" jj.mm.aaaa\"))","v":"du  08.05 au  11.05.2023"}]
["Classement par équipe",{"$nulls":6},"Classement individuel",{"$nulls":4},"Equipe",{"$nulls":3},"Equipes possibles",{"$nulls":4},"Equipes triées"]
[{"$nulls":16},"N°","Nom","Total équipe",null,null,"Rang","Nom","Prénom","Résultat","TotEquipe","Equipe"]
[1,"La Chaux-de-Fonds",null,471,{"$f":"VLOOKUP(B6,Qui!$A$201:$D$204,4)","v":1},1,null,"Tynowski","Lucien",121,{"$f":"IFERROR((VLOOKUP(CONCATENATE(H6,I6),Qui!$D$301:$F$356,3,0)),0)","v":3},{"$nulls":5},"C1","La Chaux-de-Fonds  I",{"$f":"SUMIF($M$6:$M$40,\"=\"&$Q6,$J$6:$J$40)","v":0},null,null,1,"Mores","Blaise",103,{"$f":"IF($AA6<>\"\",(IF($Y6,(INDEX($Q$6:$S$20,MATCH($AA6,$Q$6:$Q$20,0),3)),0)),0)","v":0}]
{"$rows_left_out":54}
{"sheet":"Challenge_GJ","index":12,"n_rows":84,"n_cols":37,"rows_kept":84,"hidden":true,"merged":[[0,0,0,9],[1,0,1,9],[3,16,3,18],[3,21,3,26],[3,28,3,30],[56,7,56,8]]}
["Association intercantonale\n des joueurs de boules,\nGrand Jeu Neuchâtelois\n"]
[{"$f":"CONCATENATE(Calendrier!A11,\"      Jeu : \",(Calendrier!F11))","v":"Challenge -  ÉTÉ (ex Impartial)      Jeu : La  Chaux-de-Fonds"}]
[{"$nulls":9},{"$f":"CONCATENATE(\"du\",TEXT(Calendrier!F13,\" jj.mm\"),\" au\",TEXT(Calendrier!F16,\" jj.mm.aaaa\"))","v":"du 22.04 au 25.04.2024"}]
["Classement par équipes",{"$nulls":6},"Classement individuel",{"$nulls":4},"Club",{"$nulls":3},"Clubs possibles",{"$nulls":4},"Equipes triées (RE_xx)",{"$nulls":6},"Clubs tri"]
[{"$nulls":16},"N°","Nom","Total club",null,null,"Rang","Nom","Prénom","Résultat","Total Club","Club",null,"N°","Nom","Total club"]
["1er",{"$f":"IF($D12,(INDEX($Q$6:$S$20,MATCH($AA6,$Q$6:$Q$20,0),2)),0)","v":"Le Locle"},null,null,{"$f":"VLOOKUP(B6,Qui!$A$201:$D$204,4)","v":3},1,null,"Mores","Blaise",103,{"$f":"IFERROR((VLOOKUP(CONCATENATE(H6,I6),Q_NP_ClNom_ClNo,3,0)),0)","v":4},null,{"$f":"K6","v":4},{"$nulls":3},{"$f":"Qui!D201","v":1},{"$f":"Qui!F201","v":"La Chaux-de-Fonds"},{"$f":"SUMPRODUCT(LARGE((CI_NoClub=$Q6)*(CI_Resultat),{1;2;3;4;5}))","v":205},null,null,1,"Tynowski","Lucien",101,{"$f":"IF($AA6<>\"\",(IF($Y6,(INDEX($Q$6:$S$20,MATCH($AA6,$Q$6:$Q$20,0),3)),0)),0)","v":464},3,null,4,"L'Epi",444,{"$f":"LARGE(RE_TotClub,1)","v":464},{"$f":"LARGE(RE_TotClub,2)","v":464},{"$f":"LARGE(RE_TotClub,3)","v":464},{"$f":"LARGE(RE_TotClub,4)","v":464},null,{"$f":"INDEX(RE_TotClub,$AE$6,1)","v":{"$error":"#REF!"}}]
{"$rows_left_out":79}
{"sheet":"Champions_AN","index":13,"n_rows":42,"n_cols":5,"rows_kept":42,"hidden":true,"merged":[[0,0,0,4],[1,1,1,4]]}
["Association intercantonale \ndes joueurs de boules\nGrand Jeu Neuchâtelois"]
[null,{"$f":"CONCATENATE(\"Récapitulatif pour l'année   \",YEAR(Calendrier!B6))","v":"Récapitulatif pour l'année   2024"}]
[]
[]
[]
[null,{"$f":"Calendrier!A4","v":"Challenge 80ème"},{"$f":"Calendrier!F4","v":"L'Epi"},{"$f":"Challenge_1!H57","v":"Champion de jeu : Reichen Sylvain"},{"$f":"Challenge_1!J57","v":115}]
{"$rows_left_out":37}
{"sheet":"A Ameliorer","index":14,"n_rows":14,"n_cols":5,"rows_kept":14,"hidden":true}
["Date","Qui","Accepté","Réalisé ","Quoi"]
["2019-09-01","Daniel",null,"2020-02-02","Mentionner la date d'arrivée dans l'Intercantonale pour chaque joueur ==> jubilaire"]
["2019-09-01","Daniel",null,"2020-02-02","Mentionner la date de naissance pour chaque joueur ==> sympa"]
["2019-09-01","Daniel","2020-04-09",null,"Intégrer toutes les compétitions"]
["2019-10-31","Daniel",null,"2019-12-31","Interdiction de relancer Tri si déjà fait"]
["2019-09-17","Daniel",null,"2019-09-17","Affichage des chiffres à virgule ==> suppression des décimales "]
{"$rows_left_out":8}