{"text_format":"3","workbook":"xlsx","n_sheets":15,"sheets":["Calendrier","Qui","Comment","Manche_1","Manche_2","Manche_3","Manche_4","Manche_5","Manche_6","Manche_7","Challenge_1","Challenge_2","Challenge_GJ","Champions_AN","A Ameliorer"],"not_rendered":{"images":3,"macros":1,"defined_names":33},"read":"whole","date_system":"1900"}

{"sheet":"Calendrier","index":0,"n_rows":204,"n_cols":23,"rows_kept":204,"merged":[[0,0,0,7],[1,0,1,2],[1,4,1,7],[3,0,3,2],[3,5,3,6],[10,0,10,2],[10,5,10,6],[10,11,10,12],[10,13,10,14],[17,0,17,2],[17,5,17,6],[17,13,17,14],[21,4,21,7],[23,4,23,7],[24,0,24,2],[24,5,24,6],[24,13,24,14],[31,0,31,2],[31,3,37,5],[31,6,37,7],[38,0,38,7],[39,0,39,2],[39,5,39,6],[46,0,46,2],[46,5,46,6],[53,0,53,2],[53,5,53,6],[60,0,60,2],[60,5,60,6],[67,0,67,2],[67,3,72,3],[67,5,67,6],[74,0,74,2],[74,5,74,6],[81,0,81,2],[81,5,81,6],[87,0,87,2],[87,5,87,6],[89,0,89,7],[91,0,91,1],[91,2,91,6],[92,0,92,1],[92,2,92,6]]}
["GRAND JEU NEUCHATELOIS",{"$nulls":8},"mettre votre\nclub en évidence",null,2023,2022,2021,2020,2019,2018,2017,2016,2015,2014,2013,2012]
["Entraînements",{"$nulls":3},{"$f":"CONCATENATE(\"Compétitions \",YEAR(B6))","v":"Compétitions 2024"}]
[]
["Challenge 80ème",{"$nulls":3},"Jeu :","L'Epi",null,"Marquage",{"$nulls":3},"La Chaux-de-fonds",null,null,"Evologia","La  Vue-des-Alpes","La Chaux-de-Fonds","L'Epi","La  Vue-des-Alpes","La Chaux-de-Fonds","La Chaux-de-Fonds","L'Epi","La  Vue-des-Alpes"]
[]
["Lundi","2024-03-11","Le Locle",null,"Lundi",{"$f":"B6+7","v":"2024-03-18"},"Le Locle","L'Epi"]
["Mardi",{"$f":"B6+1","v":"2024-03-12"},"L'Epi",null,"Mardi",{"$f":"F6+1","v":"2024-03-19"},"L'Epi","La Chaux-de-Fonds"]
["Mercredi",{"$f":"B7+1","v":"2024-03-13"},"La Chaux-de-Fonds",null,"Mercredi",{"$f":"F7+1","v":"2024-03-20"},"La Chaux-de-Fonds","L'Epi"]
["Jeudi",{"$f":"B8+1","v":"2024-03-14"},"La Vue-des-Alpes",null,"Jeudi",{"$f":"F8+1","v":"2024-03-21"},"La Vue-des-Alpes","L'Epi"]
[]
["Challenge -  ÉTÉ (ex Impartial)",{"$nulls":3},"Jeu :","La  Chaux-de-Fonds",null,"Marquage",null,"Nbre marquage",null,"Le Locle",{"$nulls":3},"La  Chaux-de-Fonds","Evologia","La Chaux-de-Fonds","Le Locle","L'Epi","La  Vue-des-Alpes","La Chaux-de-Fonds","Le Locle"]
[]
["Lundi","2024-04-15","Le Locle",null,"Lundi",{"$f":"B13+7","v":"2024-04-22"},"Le Locle","La Chaux-de-Fonds",null,{"$f":"Qui!A201","v":"La Chaux-de-Fonds"},{"$f":"COUNTIF(H$6:H$87,J13)-COUNTIF(H$20:H$23,J13)","v":10}]
["Mardi",{"$f":"B13+1","v":"2024-04-16"},"L'Epi",null,"Mardi",{"$f":"F13+1","v":"2024-04-23"},"L'Epi","La Chaux-de-Fonds",null,{"$f":"Qui!A202","v":"La Vue-des-Alpes"},{"$f":"COUNTIF(H$6:H$87,J14)-COUNTIF(H$20:H$23,J14)","v":7}]
["Mercredi",{"$f":"B14+1","v":"2024-04-17"},"La Chaux-de-Fonds",null,"Mercredi",{"$f":"F14+1","v":"2024-04-24"},"La Chaux-de-Fonds","L'Epi",null,{"$f":"Qui!A203","v":"Le Locle"},{"$f":"COUNTIF(H$6:H$87,J15)-COUNTIF(H$20:H$23,J15)","v":6}]
["Jeudi",{"$f":"B15+1","v":"2024-04-18"},"La Vue-des-Alpes",null,"Jeudi",{"$f":"F15+1","v":"2024-04-25"},"La Vue-des-Alpes","La Chaux-de-Fonds",null,{"$f":"Qui!A204","v":"L'Epi"},{"$f":"COUNTIF(H$6:H$87,J16)-COUNTIF(H$20:H$23,J16)","v":9}]
[]
["COUPE SUISSE",{"$nulls":3},"Jeu :","Evologia",null,"Les clubs marquent \nl'un pour l'autre",{"$nulls":3},"Grand-Sommartel","Evologia",null,null,"Evologia","Grand-Sommartel","Grand-Sommartel","La Chaux-de-Fonds","Le Locle","L'Epi","La  Vue-des-Alpes","La Chaux-de-Fonds"]
[]
["Lundi","2024-06-17","Le Locle",null,"Mercredi",{"$f":"B22+7","v":"2024-06-26"},"La Chaux-de-Fonds","L'Epi"]
["Mardi",{"$f":"B20+1","v":"2024-06-18"},"L'Epi",null,"Jeudi",{"$f":"F20+1","v":"2024-06-27"},"Le Locle","La Vue-des-Alpes"]
["Mercredi",{"$f":"B21+1","v":"2024-06-19"},"La Chaux-de-Fonds",null,"Les 16 meilleurs sont qualifiés et jouent le Tour Final dès 13h°°"]
["Jeudi",{"$f":"B22+1","v":"2024-06-20"},"La Vue-des-Alpes",null,"Samedi",{"$f":"F21+2","v":"2024-06-29"}]
[{"$nulls":4},"Inauguration officielle pour les clubistes du nouveau pont"]
["Challenge -  ÉTÉ (ex Impartial)",{"$nulls":3},"Jeu :",null,null,"Marquage",{"$nulls":4},"Le Locle",null,null,"Grand-Sommartel","La  Vue-des-Alpes","Le Locle","L'Epi","La  Vue-des-Alpes","Le Locle","Le Locle","L'Epi"]
[]
["Lundi","2023-05-01","Le Locle",null,"Lundi",{"$f":"B27+7","v":"2023-05-08"},"Le Locle"]
["Mardi",{"$f":"B27+1","v":"2023-05-02"},"L'Epi",null,"Mardi",{"$f":"F27+1","v":"2023-05-09"},"L'Epi"]
["Mercredi",{"$f":"B28+1","v":"2023-05-03"},"La Chaux-de-Fonds",null,"Mercredi",{"$f":"F28+1","v":"2023-05-10"},"La Chaux-de-Fonds"]
["Jeudi",{"$f":"B29+1","v":"2023-05-04"},"La Vue-des-Alpes",null,"Jeudi",{"$f":"F29+1","v":"2023-05-11"},"La Vue-des-Alpes"]
[{"$nulls":9},"Nbre jeu"]
["Les N° de téléphone des Responsables des Jeux",null,null,"\nToutes les compétitions,\n7.-- le requillage\n\n_______________________________\n\nPrésident de l'intercantonale\nClaude-Alain Vuillème\n 079 448 43 01\n\nsauf la Coupe Suisse\n5.-- le requillage",null,null,"Les feuilles des résultats des compétitions sont à transmettre par WhatsApp à :\n\nChristian Monnier\nRue des Marais 46\nLa Chaux-de-Fonds\n079 378 43 49\n\nMerci de cadrer correctement vos photos"]
["L'Epi","Blaise MORES  ","079 704 08 91",{"$nulls":6},{"$f":"Qui!B201","v":"Evologia"},{"$f":"COUNTIF(F$4:F$88,J33)","v":2}]
["Le Locle","Lucien TYNOWSKI ","032 931 47 02",{"$nulls":6},{"$f":"Qui!B202","v":"Grand-Sommartel"},1]
["La  Chaux-de-Fonds","Christian MONNIER","079 378 43 49",{"$nulls":6},{"$f":"Qui!B203","v":"La  Chaux-de-Fonds"},2]
["La  Vue-des-Alpes","Hervé OPPLIGER","079 301 51 15",{"$nulls":6},{"$f":"Qui!B204","v":"La  Vue-des-Alpes"},1]
["Evologia","Daniel PELLATON\n(la clé Henri-Calame 2)","079 675 72 71",{"$nulls":6},{"$f":"Qui!B205","v":"Le Locle"},1]
["Grand-Sommartel","Lucien TYNOWSKI ","032 931 47 02",{"$nulls":6},{"$f":"Qui!B206","v":"L'Epi"},2]
["Fête La Terre -  samedi & dimanche 24 et 25 août 2024\nRequillage par les clubistes - 3 personnes (Samedi 11h-14h L'Epi / 14h-17h Chx-Fds // Dimanche 11h-13h30 La Vue / 13h30-16h Locle)\n\nInauguration du Ballenberg - Lundi du Jeune 16 septembre 2024",{"$nulls":8},{"$f":"Qui!B207","v":"L'Erguel"},0]
["Championnat 1ère manche",{"$nulls":3},"Jeu :","Grand-Sommartel",null,"Marquage",{"$nulls":3},"Grand-Sommartel","Grand-Sommartel","Grand-Sommartel","Le Locle","Grand-Sommartel","Grand-Sommartel","Le Locle","Le Locle","Le Locle","Le Locle","Le Locle","Le Locle"]
[]
["Lundi","2024-08-19","Le Locle",null,"Lundi",{"$f":"B42+7","v":"2024-08-26"},"Le Locle","La Vue-des-Alpes"]
["Mardi",{"$f":"B42+1","v":"2024-08-20"},"L'Epi",null,"Mardi",{"$f":"F42+1","v":"2024-08-27"},"L'Epi","Le Locle"]
["Mercredi",{"$f":"B43+1","v":"2024-08-21"},"La Chaux-de-Fonds",null,"Mercredi",{"$f":"F43+1","v":"2024-08-28"},"La Chaux-de-Fonds","L'Epi"]
["Jeudi",{"$f":"B44+1","v":"2024-08-22"},"La Vue-des-Alpes",null,"Jeudi",{"$f":"F44+1","v":"2024-08-29"},"La Vue-des-Alpes","La Chaux-de-Fonds"]
[]
["Championnat 2ème manche",{"$nulls":3},"Jeu :","Le Locle",null,"Marquage",{"$nulls":3},"Le Locle","Le Locle","Grand-Sommartel","Grand-Sommartel","Le Locle","Le Locle","Grand-Sommartel","L'Epi","La  Vue-des-Alpes","L'Epi","Evologia","L'Epi"]
[]
["Lundi","2024-09-02","Le Locle",null,"Lundi",{"$f":"B49+7","v":"2024-09-09"},"Le Locle","La Chaux-de-Fonds"]
["Mardi",{"$f":"B49+1","v":"2024-09-03"},"L'Epi",null,"Mardi",{"$f":"F49+1","v":"2024-09-10"},"L'Epi","Le Locle"]
["Mercredi",{"$f":"B50+1","v":"2024-09-04"},"La Chaux-de-Fonds",null,"Mercredi",{"$f":"F50+1","v":"2024-09-11"},"La Chaux-de-Fonds","Le Locle"]
["Jeudi",{"$f":"B51+1","v":"2024-09-05"},"La Vue-des-Alpes",null,"Jeudi",{"$f":"F51+1","v":"2024-09-12"},"La Vue-des-Alpes","Le Locle"]
[]
["Championnat 3ème manche",{"$nulls":3},"Jeu :","Evologia",null,"Marquage",{"$nulls":3},"L'Epi","L'Epi","Le Locle","L'Erguel","La  Vue-des-Alpes","L'Epi","Evologia","La Chaux-de-Fonds","La Chaux-de-Fonds","Evologia","La  Vue-des-Alpes","La  Vue-des-Alpes"]
[]
["Lundi","2024-09-23","Le Locle",null,"Lundi",{"$f":"B56+7","v":"2024-09-30"},"Le Locle","La Chaux-de-Fonds"]
["Mardi",{"$f":"B56+1","v":"2024-09-24"},"L'Epi",null,"Mardi",{"$f":"F56+1","v":"2024-10-01"},"L'Epi","La Vue-des-Alpes"]
["Mercredi",{"$f":"B57+1","v":"2024-09-25"},"La Chaux-de-Fonds",null,"Mercredi",{"$f":"F57+1","v":"2024-10-02"},"La Chaux-de-Fonds","Le Locle"]
["Jeudi",{"$f":"B58+1","v":"2024-09-26"},"La Vue-des-Alpes",null,"Jeudi",{"$f":"F58+1","v":"2024-10-03"},"La Vue-des-Alpes","L'Epi"]
[]
["Championnat 4ème manche",{"$nulls":3},"Jeu :","La  Vue-des-Alpes",null,"Marquage",{"$nulls":3},"La Chaux-de-Fonds","La Chaux-de-Fonds","L'Epi","L'Epi","Evologia","Evologia","La  Vue-des-Alpes","La  Vue-des-Alpes","Evologia","La Chaux-de-Fonds","La Chaux-de-Fonds","Jeu erguel"]
[]
["Lundi","2024-10-21","Le Locle",null,"Lundi",{"$f":"B63+7","v":"2024-10-28"},"Le Locle","La Vue-des-Alpes"]
["Mardi",{"$f":"B63+1","v":"2024-10-22"},"L'Epi",null,"Mardi",{"$f":"F63+1","v":"2024-10-29"},"L'Epi","La Vue-des-Alpes"]
["Mercredi",{"$f":"B64+1","v":"2024-10-23"},"La Chaux-de-Fonds",null,"Mercredi",{"$f":"F64+1","v":"2024-10-30"},"La Chaux-de-Fonds","La Vue-des-Alpes"]
["Jeudi",{"$f":"B65+1","v":"2024-10-24"},"La Vue-des-Alpes",null,"Jeudi",{"$f":"F65+1","v":"2024-10-31"},"La Vue-des-Alpes","Le Locle"]
[]
["Championnat 5ème manche",null,null,"Vauquille 7ème\n24-25 octobre","Jeu :","L'Epi",null,"Marquage",{"$nulls":3},"La Vue des Alpes","Evologia","La  Chaux-de-Fonds","Evologia","L'Epi","La  Vue-des-Alpes","La Chaux-de-Fonds","Evologia","L'Epi","La  Vue-des-Alpes","L'Epi"]
[]
["Lundi","2024-11-04","Le Locle",null,"Lundi",{"$f":"B70+7","v":"2024-11-11"},"Le Locle","L'Epi"]
["Mardi",{"$f":"B70+1","v":"2024-11-05"},"L'Epi",null,"Mardi",{"$f":"F70+1","v":"2024-11-12"},"L'Epi","La Vue-des-Alpes"]
["Mercredi",{"$f":"B71+1","v":"2024-11-06"},"La Chaux-de-Fonds",null,"Mercredi",{"$f":"F71+1","v":"2024-11-13"},"La Chaux-de-Fonds","L'Epi"]
["Jeudi",{"$f":"B72+1","v":"2024-11-07"},"La Vue-des-Alpes",null,"Jeudi",{"$f":"F72+1","v":"2024-11-14"},"La Vue-des-Alpes","L'Epi"]
[]
["Championnat 6ème manche",{"$nulls":3},"Jeu :","La  Chaux-de-Fonds",null,"Marquage",{"$nulls":3},"Erguel",null,"Evologia","La  Chaux-de-Fonds","La  Chaux-de-Fonds","La Chaux-de-Fonds","L'Epi","Jeu erguel","Jeu erguel","Jeu erguel","Jeu erguel"]
[]
["Lundi","2024-11-18","Le Locle",null,"Lundi",{"$f":"B77+7","v":"2024-11-25"},"Le Locle","La Chaux-de-Fonds"]
["Mardi",{"$f":"B77+1","v":"2024-11-19"},"L'Epi",null,"Mardi",{"$f":"F77+1","v":"2024-11-26"},"L'Epi","La Chaux-de-Fonds"]
["Mercredi",{"$f":"B78+1","v":"2024-11-20"},"La Chaux-de-Fonds",null,"Mercredi",{"$f":"F78+1","v":"2024-11-27"},"La Chaux-de-Fonds","La Vue-des-Alpes"]
["Jeudi",{"$f":"B79+1","v":"2024-11-21"},"La Vue-des-Alpes",null,"Jeudi",{"$f":"F79+1","v":"2024-11-28"},"La Vue-des-Alpes","La Chaux-de-Fonds"]
[]
[{"$nulls":4},"Jeu :",null,null,"Marquage",{"$nulls":5},"La Vue-des-Alpes","La Vue-des-Alpes"]
[]
["Lundi",null,"Le Locle",null,"Lundi",{"$f":"B84+7","v":"1900-01-07"},"Le Locle"]
["Mardi",{"$f":"B84+1","v":"1900-01-01"},"L'Epi",null,"Mardi",{"$f":"F84+1","v":"1900-01-08"},"L'Epi"]
["Mercredi",{"$f":"B85+1","v":"1900-01-02"},"La Chaux-de-Fonds",null,"Mercredi",{"$f":"F85+1","v":"1900-01-09"},"La Chaux-de-Fonds"]
["Jeudi",{"$f":"B86+1","v":"1900-01-03"},"La Vue-des-Alpes",null,"Jeudi",{"$f":"F86+1","v":"1900-01-10"},"La Vue-des-Alpes"]
[]
[]
[{"$f":"CONCATENATE(\"Rappel pour le Championnat neuchâtelois:  \",CHAR(10),\" individuel  - seuls comptent les \",Qui!$A$402,\" meilleurs résultats\",CHAR(10),\" par club -  seuls comptent les \",Qui!$B$402,\" meilleurs résultats\")","v":"Rappel pour le Championnat neuchâtelois:  \n individuel  - seuls comptent les 5 meilleurs résultats\n par club -  seuls comptent les 5 meilleurs résultats"}]
[]
["Remise des prix",null,"vendredi 13 décembre 2024 à 19h00 précise\nà La Cheminée"]
["Organisation",null,"La Chaux-de-Fonds",{"$nulls":8},"Le Locle","L'Epi","La Vue-des-Alpes","La  Chaux-de-Fonds","La  Chaux-de-Fonds","Le Locle","L'Epi","La  Vue-des-Alpes","La Chaux-de-Fonds","Le Locle","L'Epi","La  Vue-des-Alpes"]
{"$rows_empty":110}
[{"$nulls":5},"Duplicata Colonne A\ntechnique"]

{"sheet":"Qui","index":1,"n_rows":516,"n_cols":16,"rows_kept":516,"hidden":true,"merged":[[196,8,196,9],[199,8,199,9],[413,2,416,2]]}
{"$rows_empty":195}
["Inventaire des  Club, Jeux, choix des couleurs"]
["Club Texte","Pour lui-même","Pour lui-même","Choix de la couleur club \npour chque club","Couleur club texte","Duplicata Colonne A\ntechnique",null,null,"Lien entre n° couleur et texte\n==> mise en forme conditionnelle"]
[{"$nulls":4},"Non modifiable","Non modifiable","Non modifiable",null,"Non modifiable","Non modifiable"]
[]
["Les_Clubs","Les_Jeux","Les_compétitions","CLUB n°","Couleur","Copie_Les_Clubs","Nb joueurs",null,"Définition des couleurs"]
["La Chaux-de-Fonds","Evologia","Challenge -  ÉTÉ (ex Impartial)",1,{"$f":"(VLOOKUP(Liste319[[#This Row],[CLUB n°]],I201:J205,2,0))","v":"bleu"},{"$f":"Liste117[[#This Row],[Les_Clubs]]","v":"La Chaux-de-Fonds"},{"$f":"COUNTIF(E$301:E$355,A201)","v":10},null,1,"bleu"]
["La Vue-des-Alpes","Grand-Sommartel","Challenge 80ème",2,{"$f":"(VLOOKUP(Liste319[[#This Row],[CLUB n°]],I202:J206,2,0))","v":"grisé"},{"$f":"Liste117[[#This Row],[Les_Clubs]]","v":"La Vue-des-Alpes"},{"$f":"COUNTIF(E$301:E$355,A202)","v":6},null,2,"grisé"]
["Le Locle","La  Chaux-de-Fonds","Challenge ÉTÉ",3,{"$f":"(VLOOKUP(Liste319[[#This Row],[CLUB n°]],I203:J207,2,0))","v":"vert"},{"$f":"Liste117[[#This Row],[Les_Clubs]]","v":"Le Locle"},{"$f":"COUNTIF(E$301:E$355,A203)","v":6},null,3,"vert"]
["L'Epi","La  Vue-des-Alpes","Challenge HIVER",4,{"$f":"(VLOOKUP(Liste319[[#This Row],[CLUB n°]],I204:J208,2,0))","v":"jaune"},{"$f":"Liste117[[#This Row],[Les_Clubs]]","v":"L'Epi"},{"$f":"COUNTIF(E$301:E$355,A204)","v":9},null,4,"jaune"]
[null,"Le Locle","Championnat 1ère manche",5,{"$f":"(VLOOKUP(Liste319[[#This Row],[CLUB n°]],I205:J209,2,0))","v":"rouge (réserve)"},{"$f":"Liste117[[#This Row],[Les_Clubs]]","v":0},null,null,5,"rouge (réserve)"]
[null,"L'Epi","Championnat 2ème manche",null,null,{"$f":"Liste117[[#This Row],[Les_Clubs]]","v":0},{"$nulls":3},"le reste est blanc"]
[null,"L'Erguel","Championnat 3ème manche",null,null,{"$f":"Liste117[[#This Row],[Les_Clubs]]","v":0}]
[null,null,"Championnat 4ème manche",null,null,{"$f":"Liste117[[#This Row],[Les_Clubs]]","v":0}]
[null,null,"Championnat 5ème manche",null,null,{"$f":"Liste117[[#This Row],[Les_Clubs]]","v":0}]
[null,null,"Championnat 6ème manche",null,null,{"$f":"Liste117[[#This Row],[Les_Clubs]]","v":0},"Total clubistes"]
[null,null,"Championnat 7ème manche",null,null,{"$f":"Liste117[[#This Row],[Les_Clubs]]","v":0},{"$f":"SUM(G201:G210)","v":31}]
[null,null,"COUPE SUISSE"]
{"$rows_empty":83}
["Les Membres"]
[]
[null,null,"Non modifiable","Non modifiable",null,"Non modifiable","Non modifiable","Non modifiable"]
[]
["Nom","Prenom","NomPrenom","NP","ClubNom","ClubNo","Nom dupl","Prénom dupl","Rue","NPA","Ville","Tél","Courriel","Date de \nnaissance","Joueur \ndepuis","J'utilise\nWhatsapp"]
["Aeschlimann","Loris",{"$f":"CONCATENATE(A301,\" \",B301)","v":"Aeschlimann Loris"},{"$f":"CONCATENATE(A301,B301)","v":"AeschlimannLoris"},"L'Epi",{"$f":"(VLOOKUP(E301,Qui!$A$201:$D$211,4))","v":4},{"$f":"A301","v":"Aeschlimann"},{"$f":"B301","v":"Loris"},"Les Crêts 5",2056,"Dombresson","+41 79 325 07 85","Loris.aeschlimann@gmail.com","1990-06-19","2022-01-01","oui"]
["Bart","Fabien","Bart Fabien","BartFabien","Le Locle",{"$f":"(VLOOKUP(E302,Qui!$A$201:$D$211,4))","v":3},"Bart","Fabien","La Sagne Eglise 145a",2314,"La Sagne","+41796958609","francoise.bart@net2000.ch",null,"1993-01-01"]
["Billod-Morel","Gérald","Billod-Morel Gérald","Billod-MorelGérald","La Chaux-de-Fonds",{"$f":"(VLOOKUP(E303,Qui!$A$201:$D$211,4))","v":1},"Billod-Morel","Gérald","Cornes-Morel 41",2300,"La Chaux-de-Fonds","+41798221983","geraldbillod@gmail.com","1971-08-01","2017-01-01","oui"]
["Bourquin","Willy","Bourquin Willy","BourquinWilly","L'Epi",{"$f":"(VLOOKUP(E304,Qui!$A$201:$D$211,4))","v":4},"Bourquin","Willy","Les Vieux-Prés 2",2054,"Les Vieux-Prés","+41 79 125 29 97","wbourquin@bluewin.ch","1944-03-22","2012-01-01","oui"]
["Cassi","Alain","Cassi Alain","CassiAlain","Le Locle",{"$f":"(VLOOKUP(E305,Qui!$A$201:$D$211,4))","v":3},"Cassi","Alain","les Bulles 18",2300,"La Chaux-de-Fonds","+41329681245","alainvero@gmail.com",null,"D 1990"]
["Chassot","Yves","Chassot Yves","ChassotYves","La Vue-des-Alpes",{"$f":"(VLOOKUP(E306,Qui!$A$201:$D$211,4))","v":2},"Chassot","Yves","Combes 3",2042,"Fontaines","+41 79 482 96 88","yves.chassot@gmail.com","1971-02-05","2000-01-01","oui"]
["Coppet","Romain","Coppet Romain","CoppetRomain","Le Locle",{"$f":"(VLOOKUP(E307,Qui!$A$201:$D$211,4))","v":3},"Coppet","Romain","Philippe-Henri-Matthey 15",2300,"La Chaux-de-Fonds"]
["Dick","Pierre-Alain","Dick Pierre-Alain","DickPierre-Alain","La Vue-des-Alpes",{"$f":"(VLOOKUP(E308,Qui!$A$201:$D$211,4))","v":2},"Dick","Pierre-Alain","La Biche 1",2054,"Les Vieux-Prés","* 032 853 27 40  +41 79 796 32 34","pierre-alain.dick@ne.ch","1967-07-27","1997-01-01","oui"]
["Dubois","Emmanuel","Dubois Emmanuel","DuboisEmmanuel","La Chaux-de-Fonds",{"$f":"(VLOOKUP(E309,Qui!$A$201:$D$211,4))","v":1},"Dubois","Emmanuel","Route des Provins 2",2087,"Cornaux","+41798980701","emmanuel.dubois93@gmail.com","1993-04-05","2019-01-01","oui"]
["Dubois","Eric","Dubois Eric","DuboisEric","La Chaux-de-Fonds",{"$f":"(VLOOKUP(E310,Qui!$A$201:$D$211,4))","v":1},"Dubois","Eric","Route de Cottendart 15",2013,"Colombier","+41763160852","eric.dubois311@gmail.com","1972-03-26","2016-01-01","oui"]
["Dubois","Marcel","Dubois Marcel","DuboisMarcel","La Chaux-de-Fonds",{"$f":"(VLOOKUP(E311,Qui!$A$201:$D$211,4))","v":1},"Dubois","Marcel","Rue du Locle 32",2300,"La Chaux-de-Fonds","+41764233384 +41329144618",null,"1994-12-14","1970-01-01"]
["Favre","Daniel","Favre Daniel","FavreDaniel","Le Locle",{"$f":"(VLOOKUP(E312,Qui!$A$201:$D$211,4))","v":3},"Favre","Daniel","Rue Jardinière 113",2300,"La Chaux-de-Fonds","+41794458191 +41329134030",null,null,"2010-01-01","oui"]
["Frutiger","Bertrand","Frutiger Bertrand","FrutigerBertrand","L'Epi",{"$f":"(VLOOKUP(E313,Qui!$A$201:$D$211,4))","v":4},"Frutiger","Bertrand","Impasse des Saules 1",2053,"Cernier","+41794011093 +41328532139",null,null,"2010-01-01"]
["Haussener","Philippe","Haussener Philippe","HaussenerPhilippe","La Vue-des-Alpes",{"$f":"(VLOOKUP(E314,Qui!$A$201:$D$211,4))","v":2},"Haussener","Philippe","Chemin de la Pépinière 1",2046,"Fontaines","+41 79 213 81 65","haussenerphv@gmail.com","1968-01-03","2014-01-01","oui"]
["Jean-Mairet","Jean-Claude","Jean-Mairet Jean-Claude","Jean-MairetJean-Claude","La Chaux-de-Fonds",{"$f":"(VLOOKUP(E315,Qui!$A$201:$D$211,4))","v":1},"Jean-Mairet","Jean-Claude","Progrès 103",2300,"La Chaux-de-Fonds","+41329135462",null,"29.05.194","2015-01-01"]
["Jeanneret","Louis","Jeanneret Louis","JeanneretLouis","La Vue-des-Alpes",{"$f":"(VLOOKUP(E316,Qui!$A$201:$D$211,4))","v":2},"Jeanneret","Louis","Rue de la Promenade 14",2052,"Fontainemelon","+41 79 796 39 19  +41328536368","louis.jeanneret@ne.ch","1976-04-02","2001-01-01","oui"]
["Kemajl","Fetahi","Kemajl Fetahi","KemajlFetahi","Le Locle",{"$f":"(VLOOKUP(E317,Qui!$A$201:$D$211,4))","v":3},"Kemajl","Fetahi","Rue de l'Helvétie 23",2300,"La Chaux-de-Fonds",{"$nulls":3},"2015-01-01"]
["Matthey","Pierre","Matthey Pierre","MattheyPierre","La Chaux-de-Fonds",{"$f":"(VLOOKUP(E318,Qui!$A$201:$D$211,4))","v":1},"Matthey","Pierre","Rue des Bouleaux 1",2300,"La Chaux-de-Fonds","+41793489512","pierrotmatthey@bluewin.ch","1951-09-27","1972-01-01","non"]
["Monnier","Christian","Monnier Christian","MonnierChristian","La Chaux-de-Fonds",{"$f":"(VLOOKUP(E319,Qui!$A$201:$D$211,4))","v":1},"Monnier","Christian","Rue du Marais 46",2300,"La Chaux-de-Fonds","+41793784349 +41329681347","csmonnier@bluewin.ch","1962-08-30","2003-01-01","oui"]
["Mores","Blaise","Mores Blaise","MoresBlaise","L'Epi",{"$f":"(VLOOKUP(E320,Qui!$A$201:$D$211,4))","v":4},"Mores","Blaise","Boulevard des Endroits 42",2300,"La Chaux-de-Fonds","+41797040891\n+41329267877","catherinemonnin@gmail.com","1962-10-02","1990 a ver","oui"]
["Oppliger","Hervé","Oppliger Hervé","OppligerHervé","La Vue-des-Alpes",{"$f":"(VLOOKUP(E321,Qui!$A$201:$D$211,4))","v":2},"Oppliger","Hervé","Le Crêt du Châble 7",2057,"Villiers"," +41 79 301 51 15 +41328534052","h.oppliger57@bluewin.ch","1957-01-26","2009-01-01","oui"]
["Pellaton","Daniel","Pellaton Daniel","PellatonDaniel","L'Epi",{"$f":"(VLOOKUP(E322,Qui!$A$201:$D$211,4))","v":4},"Pellaton","Daniel","Rue des Pierres Grises 17",2053,"Cernier","+41796757271\n+41328520443","daniel@pellaton.ch","1958-09-13","2008-01-01","oui"]
["Reichen","Sylvain","Reichen Sylvain","ReichenSylvain","L'Epi",{"$f":"(VLOOKUP(E323,Qui!$A$201:$D$211,4))","v":4},"Reichen","Sylvain","Rue des Terraux 41",2300,"La Chaux-de-Fonds","+41797680522 +41329685392",null,"1944-12-08","1972-01-01","non"]
["Rindlisbacher","Heinz","Rindlisbacher Heinz","RindlisbacherHeinz","L'Epi",{"$f":"(VLOOKUP(E324,Qui!$A$201:$D$211,4))","v":4},"Rindlisbacher","Heinz","Chemin du Mont d'Amin 2",2052,"Fontainemelon","+41794791816","heguriba@gmail.com","1956-02-08","2014-01-01","oui"]
["Rollat","Christian","Rollat Christian","RollatChristian","La Chaux-de-Fonds",{"$f":"(VLOOKUP(E325,Qui!$A$201:$D$211,4))","v":1},"Rollat","Christian","Rue du Crêt 2",2300,"La Chaux-de-Fonds","+41793320738  +41329684491","rollat.christian@gmail.com","1962-03-04","2011-01-01","non"]
["Rossier","Yves-Alain","Rossier Yves-Alain","RossierYves-Alain","L'Epi",{"$f":"(VLOOKUP(E326,Qui!$A$201:$D$211,4))","v":4},"Rossier","Yves-Alain","Les Vieux-Prés 3",2054,"Les Vieux-Prés","+41797139187  +41328532179","yarossier@bluewin.ch","1962-04-03","2013-01-01","oui"]
["Tinguely","Didier","Tinguely Didier","TinguelyDidier","La Chaux-de-Fonds",{"$f":"(VLOOKUP(E327,Qui!$A$201:$D$211,4))","v":1},"Tinguely","Didier","Chemin des Sorbiers 21",2400,"Le Locle","+41329314702",null,null,"2019-01-01"]
["Tynowski","Lucien","Tynowski Lucien","TynowskiLucien","Le Locle",{"$f":"(VLOOKUP(E328,Qui!$A$201:$D$211,4))","v":3},"Tynowski","Lucien","Chemin des Sorbiers 21",2400,"Le Locle","+41796703979   +41329314702","cl.tynowski@hispeed.ch",null,"D 1990","oui"]
["Voirol","Pierre","Voirol Pierre","VoirolPierre","La Chaux-de-Fonds",{"$f":"(VLOOKUP(E329,Qui!$A$201:$D$211,4))","v":1},"Voirol","Pierre","Rue Charles-Humbert 8",2300,"La Chaux-de-Fonds","+41329132256","pierre.voirol@gmail.com","1962-01-25","2014-01-01","oui"]
["Vuillème","Claude-Alain","Vuillème Claude-Alain","VuillèmeClaude-Alain","La Vue-des-Alpes",{"$f":"(VLOOKUP(E330,Qui!$A$201:$D$211,4))","v":2},"Vuillème","Claude-Alain","Les Loges 18",2052,"La Vue-des-Alpes","+41328535225 +41794484301","ca.vuilleme@gmail.com","1964-06-02","2009-01-01","oui"]
["Wäfler","Jean-Louis","Wäfler Jean-Louis","WäflerJean-Louis","L'Epi",{"$f":"(VLOOKUP(E331,Qui!$A$201:$D$211,4))","v":4},"Wäfler","Jean-Louis","Les Foulets 7",2300,"La Chaux-de-Fonds"," +41774229744 +41329136443",null,null,"D 1990","non"]
["ZZ1","Z2","ZZ1 Z2","ZZ1Z2",null,{"$f":"(VLOOKUP(E332,Qui!$A$201:$D$211,4))","v":{"$error":"#N/A"}},"ZZ1","Z2"]
["ZZ1","Z2",{"$f":"CONCATENATE(A333,\" \",B333)","v":"ZZ1 Z2"},{"$f":"CONCATENATE(A333,B333)","v":"ZZ1Z2"},null,{"$f":"(VLOOKUP(E333,Qui!$A$201:$D$211,4))","v":{"$error":"#N/A"}},{"$f":"A333","v":"ZZ1"},{"$f":"B333","v":"Z2"}]
["ZZ1","Z2","ZZ1 Z2","ZZ1Z2",null,{"$f":"(VLOOKUP(E334,Qui!$A$201:$D$211,4))","v":{"$error":"#N/A"}},"ZZ1","Z2"]
["ZZ1","Z2","ZZ1 Z2","ZZ1Z2",null,{"$f":"(VLOOKUP(E335,Qui!$A$201:$D$211,4))","v":{"$error":"#N/A"}},"ZZ1","Z2"]
["ZZ1","Z2","ZZ1 Z2","ZZ1Z2",null,{"$f":"(VLOOKUP(E336,Qui!$A$201:$D$211,4))","v":{"$error":"#N/A"}},"ZZ1","Z2"]
["ZZ1","Z2","ZZ1 Z2","ZZ1Z2",null,{"$f":"(VLOOKUP(E337,Qui!$A$201:$D$211,4))","v":{"$error":"#N/A"}},"ZZ1","Z2"]
["ZZ1","Z2","ZZ1 Z2","ZZ1Z2",null,{"$f":"(VLOOKUP(E338,Qui!$A$201:$D$211,4))","v":{"$error":"#N/A"}},"ZZ1","Z2"]
["ZZ1","Z2","ZZ1 Z2","ZZ1Z2",null,{"$f":"(VLOOKUP(E339,Qui!$A$201:$D$211,4))","v":{"$error":"#N/A"}},"ZZ1","Z2"]
["ZZ1","Z2","ZZ1 Z2","ZZ1Z2",null,{"$f":"(VLOOKUP(E340,Qui!$A$201:$D$211,4))","v":{"$error":"#N/A"}},"ZZ1","Z2"]
["ZZ1","Z2","ZZ1 Z2","ZZ1Z2",null,{"$f":"(VLOOKUP(E341,Qui!$A$201:$D$211,4))","v":{"$error":"#N/A"}},"ZZ1","Z2"]
["ZZ1","Z2","ZZ1 Z2","ZZ1Z2",null,{"$f":"(VLOOKUP(E342,Qui!$A$201:$D$211,4))","v":{"$error":"#N/A"}},"ZZ1","Z2"]
["ZZ1","Z2","ZZ1 Z2","ZZ1Z2",null,{"$f":"(VLOOKUP(E343,Qui!$A$201:$D$211,4))","v":{"$error":"#N/A"}},"ZZ1","Z2"]
["ZZ1","Z2","ZZ1 Z2","ZZ1Z2",null,{"$f":"(VLOOKUP(E344,Qui!$A$201:$D$211,4))","v":{"$error":"#N/A"}},"ZZ1","Z2"]
["ZZ1","Z2","ZZ1 Z2","ZZ1Z2",null,{"$f":"(VLOOKUP(E345,Qui!$A$201:$D$211,4))","v":{"$error":"#N/A"}},"ZZ1","Z2"]
["ZZ1","Z2","ZZ1 Z2","ZZ1Z2",null,{"$f":"(VLOOKUP(E346,Qui!$A$201:$D$211,4))","v":{"$error":"#N/A"}},"ZZ1","Z2"]
["ZZ1","Z2","ZZ1 Z2","ZZ1Z2",null,{"$f":"(VLOOKUP(E347,Qui!$A$201:$D$211,4))","v":{"$error":"#N/A"}},"ZZ1","Z2"]
["ZZ1","Z2","ZZ1 Z2","ZZ1Z2",null,{"$f":"(VLOOKUP(E348,Qui!$A$201:$D$211,4))","v":{"$error":"#N/A"}},"ZZ1","Z2"]
["ZZ1","Z2","ZZ1 Z2","ZZ1Z2",null,{"$f":"(VLOOKUP(E349,Qui!$A$201:$D$211,4))","v":{"$error":"#N/A"}},"ZZ1","Z2"]
["ZZ1","Z2","ZZ1 Z2","ZZ1Z2",null,{"$f":"(VLOOKUP(E350,Qui!$A$201:$D$211,4))","v":{"$error":"#N/A"}},"ZZ1","Z2"]
[null,null," "]
{"$rows_empty":46}
["Eléments techniques - Règlements de jeu"]
["Championnat ","Championnat "]
["Classement général individuel","Classement par club"]
["Nombre de résultats \nqui comptent ","Nombre de résultats\npar équipe"]
[5,5]
{"$rows_empty":8}
["Outils"]
[]
[]
[null,null,0]
[{"$nulls":3},1,"Modifications impossibles, classeurs et feuilles protégés"]
[{"$nulls":3},0,"Modifications possibles, Classeurs et feuilles libres (ATTENTION)"]
[]
[]
[]
[]
[]
[{"$nulls":3},"mot de passe : aa"]
{"$rows_empty":77}
["ANCIENS MEMBRES"]
[]
[null,null,"Non modifiable","Non modifiable",null,"Non modifiable","Non modifiable","Non modifiable"]
[{"$nulls":11},"+41 79 325 07 85"]
["Nom","Prenom","NomPrenom","NP","ClubNom","ClubNo","Nom dupl","Prénom dupl","Rue","NPA","Ville","Tél","Courriel","Date de \nnaissance","Joueur \ndepuis","J'utilise\nWhatsapp"]
["Blaser","Jean-Pierre","Blaser Jean-Pierre","BlaserJean-Pierre","La Chaux-de-Fonds",4,"Blaser","Jean-Pierre","Rue de la Croix-Fédérale 48",2300,"La Chaux-de-Fonds","+41329132040"]
["Cuche","Roland","Cuche Roland","CucheRoland","La Vue-des-Alpes",1,"Cuche","Roland","Rue de la Chapelle 8",2208,"Les Hauts-Geneveys NE","* 032 853 55 89"]
["Dubois","Georges","Dubois Georges","DuboisGeorges","La Chaux-de-Fonds",4,"Dubois","Georges","Rue de la Charrière 42",2300,"La Chaux-de-Fonds","+41774520866\n+41329688312"]
["Kiepfer","Marcel","Kiepfer Marcel","KiepferMarcel","La Vue-des-Alpes",1,"Kiepfer","Marcel","Rue Monique-St-Hélier 7",2300,"La Chaux-de-Fonds","+41796112760\n+41329681796","mkipfer@hispeed.ch"]
["Monnier","Marion",{"$f":"CONCATENATE(A509,\" \",B509)","v":"Monnier Marion"},{"$f":"CONCATENATE(A509,B509)","v":"MonnierMarion"},"La Chaux-de-Fonds",{"$f":"(VLOOKUP(E509,Qui!$A$201:$D$211,4))","v":1},{"$f":"A509","v":"Monnier"},{"$f":"B509","v":"Marion"},{"$nulls":6},"2016-01-01"]
["Oppliger","Sylvain","Oppliger Sylvain","OppligerSylvain","Le Locle",2,"Oppliger","Sylvain","Route de la Croix 34",1589,"Chabrey",null,"sylvano73@hotmail.com"]
["Oppliger","Sylvain",{"$f":"CONCATENATE(A511,\" \",B511)","v":"Oppliger Sylvain"},{"$f":"CONCATENATE(A511,B511)","v":"OppligerSylvain"},"Le Locle",{"$f":"(VLOOKUP(E511,Qui!$A$201:$D$211,4))","v":3},{"$f":"A511","v":"Oppliger"},{"$f":"B511","v":"Sylvain"},{"$nulls":6},"1996-01-01"]
["Rollat","Christian","Rollat Christian","RollatChristian","La Chaux-de-Fonds",4,"Rollat","Christian","Rue du Crêt 2",2300,"La Chaux-de-Fonds","+41329684491"]
["Vuagneux","Charles","Vuagneux Charles","VuagneuxCharles","L'Epi",5,"Vuagneux","Charles",null,2300,"La Chaux-de-Fonds","+41794881660\n+41329688369"]
["Gerber","Michel",{"$f":"CONCATENATE(A514,\" \",B514)","v":"Gerber Michel"},{"$f":"CONCATENATE(A514,B514)","v":"GerberMichel"},"Le Locle",{"$f":"(VLOOKUP(E514,Qui!$A$201:$D$211,4))","v":3},{"$f":"A514","v":"Gerber"},{"$f":"B514","v":"Michel"},"Rue du St-Gothard 34",2300,"La Chaux-de-Fonds","+41329269296    +41799265851  ",null,"1965-06-05","2013-01-01"]
["Charlet","Léon","Charlet Léon","CharletLéon","La Vue-des-Alpes",2,"Charlet","Léon","Fritz-Courvoisier 21",2300,"La Chaux-de-Fonds","+41795107075","leonchat@outlook.com","1998-04-02","2019-01-01","oui"]
["Bühler","Raymond",{"$f":"CONCATENATE(A516,\" \",B516)","v":"Bühler Raymond"},{"$f":"CONCATENATE(A516,B516)","v":"BühlerRaymond"},"L'Epi",{"$f":"(VLOOKUP(E516,Qui!$A$201:$D$211,4))","v":4},{"$f":"A516","v":"Bühler"},{"$f":"B516","v":"Raymond"},"Rue du Parc 11",2300,"La Chaux-de-Fonds","+41794713615","rbuhler@hispeed.ch","1949-06-01"]

{"sheet":"Comment","index":2,"n_rows":181,"n_cols":6,"rows_kept":181,"hidden":true}
["Onglet Calendrier"]
[]
["Choisir la compétition dans la liste déroulante "]
["Choisir le Jeu (pont) dans la liste déroulante"]
["Remplir la première date de l'entrainement et les suivantes se mettent automatiquement"]
["Choisir les clubs marqueurs (Un décompte du nombre de marquages ce fait automatiquement)"]
["Attention pour les compétitions à Evologia au regard des examens des Fleuristes (en général début juin)"]
["Si possible tenir comptes des vacances scolaires et de la fermeture du restaurant du Grand-Sommartel"]
[]
["Modifier les dates de Fête La Terre"]
["Mentionner les dates de la Vauquille"]
[]
["Dans le rappel, le nombre de résultats pris en compte provient automatiquement de l'Onglet Qui (Eléments techniques)"]
[]
[]
[]
[]
[]
["Onglet Qui"]
[]
[{"$f":"Qui!A196","v":"Inventaire des  Club, Jeux, choix des couleurs"}]
[]
["L'exactitude du nom des clubs est IMPERATIVE (On ne peut plus changer)"]
["Chaque entité doit être triée pour elle-même :"]
["- Les_Clubs"]
["- Les Jeux"]
["- Les Compétitions"]
[]
["Le lien couleur entre les_Clubs et Clubs n° se fait entre colonne A et D"]
[]
["On découvre aussi la répartition des joueurs entre les clubs"]
[]
[{"$f":"Qui!A296","v":"Les Membres"}]
["Possibilité d'introduire 55 joueurs"]
[]
["Introduire les joueurs (Nom, Prénom,  Club, Rue, NPA, Ville, Tél, e-mail) le reste est automatique"]
["Les colonnes C, D, F, G et H sont automatiques (ne pas les remplir)"]
[]
[" ==> Si pas trié alors les couleurs des joueurs peuvent être fausses (lancer macro dans Qui \"Trier les membres\")"]
[]
[]
[]
[]
[{"$f":"Qui!A398","v":"Eléments techniques - Règlements de jeu"}]
[]
["Ces éléments sont à vérifier en début de saison :"]
["- Nombre de résultats à comptabiliser par joueur sur le championnat (si tous alors mettre 6 identique au nombre de manches de la saison)"]
["- Nombre de joueurs par équipe pour le championnat ==> on cumule donc les x meilleurs résultats du club de chaque manche)"]
[]
[]
[{"$f":"Qui!A411","v":"Outils"}]
[]
["Possibilité de dévérouiller et d'effectuer des modifications "]
[]
["Lancement du tri des membres "]
[]
[]
["Onglets Challenge_x"]
[]
[]
["Les cellules des scores non remplies doivent être à 0"]
["(pour remplir plusieures cellules en 1 fois, sélectionner toutes les cellules voulues, presser sur zéro et pour valider presser sur Ctrl-Return)"]
[]
["Possibilité d'introduire jusqu'à  49 joueurs"]
[]
[]
["En cas d'égalité entre plusieurs joueurs,  pour les \"départager\" selon les critères de l'art 4 :"]
["==> il faut ajouter . 01 (ou rien)  pour le moins bon et jusqu'à .07 pour le meilleur"]
[]
[]
["Pour la manche "]
[]
["a) Introduire les scores sur le classement individuel (Colonnes H6 à J54) en accord avec les membres (Qui)"]
["- Colonne H : Nom"]
["- Colonne I : Prénom"]
["- Colonne J : Score de la manche"]
[]
["b) Une fois les scores de tous les joueurs inscrits, compléter le N° d'équipe pour chaque joueur"]
[]
["- Colonne M : N° de l'équipe (en accord avec la liste des Equipes possibles)"]
[]
["c) Une fois les scores de tous les joueurs inscrits, lancer le tri en cliquant sur \"Tri des résultats de la manche x\""]
{"$rows_empty":8}
["Onglets Manche_x"]
[]
[]
["Ne pas trier les classements avant d'introduire les scores"]
["Les cellules des scores non remplies doivent être à 0"]
["(pour remplir plusieures cellules en 1 fois, sélectionner toutes les cellules voulues, presser sur zéro et pour valider presser sur Ctrl-Return)"]
[]
["Possibilité d'afficher jusqu'à  49 joueurs (actuellement les joueurs 36 à 54 sont masqués)"]
[]
[]
["En cas d'égalité entre plusieurs joueurs,  pour les \"départager\" selon les critères de l'art 4 :"]
["==> il faut ajouter . 01 (ou rien)  pour le moins bon et jusqu'à .07 pour le meilleur"]
[]
[]
["Pour la manche "]
[]
["a) Introduire les scores sur le classement individuel (Colonnes M5 à O58) en accord avec les membres (Qui)"]
["- Colonne M : Nom"]
["- Colonne N : Prénom"]
["- Colonne O : Score de la manche"]
[]
["b) Une fois les scores de tous les joueurs inscrits, lancer le tri en cliquant sur \"Tri des résultats de la manche1\""]
[]
[]
["Pour les manches suivantes"]
[]
["a) Lancer la préparation en cliquant sur \"Préparation de manche x\""]
[]
["b) Introduire les scores sur le classement individuel (Colonnes M5 à O58) - Ne pas trier les classements avant d'introduire les scores"]
["- Colonne M : Nom (si nouveau => à la suite des autres)"]
["- Colonne N : Prénom (si nouveau => à la suite des autres)"]
["- Colonne O : Score de la manche"]
[]
["c) Une fois les scores de tous les joueurs inscrits, lancer le tri en cliquant sur \"Tri des résultats de la manche x\""]
[]
[]
["NOTA BENE"]
["les colonnes représentant les manches 8 et 9 son masquées (K et L)"]
[]
["les lignes pour les joueurs > 35 sont masquées au max 54 (40 à 67)"]
["les lignes pour les clubs > 4 sont masquées (66 et 67)"]
{"$rows_empty":49}
[{"$nulls":5},"Duplicata Colonne A\ntechnique"]

{"sheet":"Manche_1","index":3,"n_rows":74,"n_cols":21,"rows_kept":74,"hidden":true,"merged":[[0,0,0,17],[1,0,1,17],[2,0,2,1],[2,15,2,17],[3,15,3,17],[60,1,60,2],[60,15,60,16],[67,1,67,2],[68,12,68,17],[70,1,70,17],[71,1,71,17],[72,1,72,17],[73,1,73,17]]}
["Association intercantonale \ndes joueurs de boules\nGrand Jeu Neuchâtelois"]
[{"$f":"CONCATENATE(\"Championnat grand jeu neuchâtelois \",YEAR(Calendrier!B6))","v":"Championnat grand jeu neuchâtelois 2024"}]
["Classement général individuel",null,"Manches",{"$f":"Calendrier!F40","v":"Grand-Sommartel"},{"$f":"Calendrier!F47","v":"Le Locle"},{"$f":"Calendrier!F54","v":"Evologia"},{"$f":"Calendrier!F61","v":"La  Vue-des-Alpes"},{"$f":"Calendrier!F68","v":"L'Epi"},{"$f":"Calendrier!F75","v":"La  Chaux-de-Fonds"},{"$f":"Calendrier!F82","v":"00:00:00"},null,null,{"$f":"CONCATENATE(\"Général\",CHAR(10),\"les \",Qui!$A$402,\" meilleurs\")","v":"Général\nles 5 meilleurs"},null,null,{"$f":"CONCATENATE(\"Classement de la manche\",CHAR(10),Calendrier!F40,CHAR(10),\"du\",TEXT(Calendrier!F42,\" jj.mm\"),\" au\",TEXT(Calendrier!F45,\" jj.mm.aaaa\"))","v":"Classement de la manche\nGrand-Sommartel\ndu 26.08 au 29.08.2024"},{"$nulls":4},{"$f":"CONCATENATE(TEXT(Calendrier!F42,\" jj.mm\"),\" au\",TEXT(Calendrier!F45,\" jj.mm.aaaa\"))","v":" 26.08 au 29.08.2024"}]
[{"$nulls":3},1,2,3,4,5,6,7,8,9,{"$nulls":3},{"$f":"CONCATENATE(\"Champion de jeu : \",CHAR(10),P5,\" \",Q5)","v":"Champion de jeu : \nBart Fabien"}]
[1,"Bart","Fabien",118,0,0,0,0,0,0,null,null,{"$f":"SUM(D5:L5*(D5:L5>=LARGE(D5:L5,Qui!$A$402)))","v":118},{"$f":"IFERROR((VLOOKUP(CONCATENATE(B5,C5),Qui!$D$301:$F$356,3,)),0)","v":3},1,"Bart","Fabien",118,{"$f":"IFERROR((VLOOKUP(CONCATENATE(P5,Q5),Qui!$D$301:$F$356,3,0)),0)","v":3}]
[2,"Tynowski","Lucien",{"v":110.2,"d":"110"},0,0,0,0,0,0,null,null,{"$f":"SUM(D6:L6*(D6:L6>=LARGE(D6:L6,Qui!$A$402)))","v":{"v":110.2,"d":"110"}},{"$f":"IFERROR((VLOOKUP(CONCATENATE(B6,C6),Qui!$D$301:$F$356,3,)),0)","v":3},2,"Tynowski","Lucien",{"v":110.2,"d":"110"},{"$f":"IFERROR((VLOOKUP(CONCATENATE(P6,Q6),Qui!$D$301:$F$356,3,0)),0)","v":3}]
[3,"Mores","Blaise",110,0,0,0,0,0,0,null,null,{"$f":"SUM(D7:L7*(D7:L7>=LARGE(D7:L7,Qui!$A$402)))","v":110},{"$f":"IFERROR((VLOOKUP(CONCATENATE(B7,C7),Qui!$D$301:$F$356,3,)),0)","v":4},3,"Mores","Blaise",110,{"$f":"IFERROR((VLOOKUP(CONCATENATE(P7,Q7),Qui!$D$301:$F$356,3,0)),0)","v":4}]
[4,"Vuillème","Claude-Alain",107,0,0,0,0,0,0,null,null,{"$f":"SUM(D8:L8*(D8:L8>=LARGE(D8:L8,Qui!$A$402)))","v":107},{"$f":"IFERROR((VLOOKUP(CONCATENATE(B8,C8),Qui!$D$301:$F$356,3,)),0)","v":2},4,"Vuillème","Claude-Alain",107,{"$f":"IFERROR((VLOOKUP(CONCATENATE(P8,Q8),Qui!$D$301:$F$356,3,0)),0)","v":2}]
[5,"Voirol","Pierre",104,0,0,0,0,0,0,null,null,{"$f":"SUM(D9:L9*(D9:L9>=LARGE(D9:L9,Qui!$A$402)))","v":104},{"$f":"IFERROR((VLOOKUP(CONCATENATE(B9,C9),Qui!$D$301:$F$356,3,)),0)","v":1},5,"Voirol","Pierre",104,{"$f":"IFERROR((VLOOKUP(CONCATENATE(P9,Q9),Qui!$D$301:$F$356,3,0)),0)","v":1}]
[6,"Dick","Pierre-Alain",99,0,0,0,0,0,0,null,null,{"$f":"SUM(D10:L10*(D10:L10>=LARGE(D10:L10,Qui!$A$402)))","v":99},{"$f":"IFERROR((VLOOKUP(CONCATENATE(B10,C10),Qui!$D$301:$F$356,3,)),0)","v":2},6,"Dick","Pierre-Alain",99,{"$f":"IFERROR((VLOOKUP(CONCATENATE(P10,Q10),Qui!$D$301:$F$356,3,0)),0)","v":2}]
[7,"Jeanneret","Louis",98,0,0,0,0,0,0,null,null,{"$f":"SUM(D11:L11*(D11:L11>=LARGE(D11:L11,Qui!$A$402)))","v":98},{"$f":"IFERROR((VLOOKUP(CONCATENATE(B11,C11),Qui!$D$301:$F$356,3,)),0)","v":2},7,"Jeanneret","Louis",98,{"$f":"IFERROR((VLOOKUP(CONCATENATE(P11,Q11),Qui!$D$301:$F$356,3,0)),0)","v":2}]
[8,"Oppliger","Hervé",97,0,0,0,0,0,0,null,null,{"$f":"SUM(D12:L12*(D12:L12>=LARGE(D12:L12,Qui!$A$402)))","v":97},{"$f":"IFERROR((VLOOKUP(CONCATENATE(B12,C12),Qui!$D$301:$F$356,3,)),0)","v":2},8,"Oppliger","Hervé",97,{"$f":"IFERROR((VLOOKUP(CONCATENATE(P12,Q12),Qui!$D$301:$F$356,3,0)),0)","v":2}]
[9,"Monnier","Christian",96,0,0,0,0,0,0,null,null,{"$f":"SUM(D13:L13*(D13:L13>=LARGE(D13:L13,Qui!$A$402)))","v":96},{"$f":"IFERROR((VLOOKUP(CONCATENATE(B13,C13),Qui!$D$301:$F$356,3,)),0)","v":1},9,"Monnier","Christian",96,{"$f":"IFERROR((VLOOKUP(CONCATENATE(P13,Q13),Qui!$D$301:$F$356,3,0)),0)","v":1}]
[10,"Rossier","Yves-Alain",92,0,0,0,0,0,0,null,null,{"$f":"SUM(D14:L14*(D14:L14>=LARGE(D14:L14,Qui!$A$402)))","v":92},{"$f":"IFERROR((VLOOKUP(CONCATENATE(B14,C14),Qui!$D$301:$F$356,3,)),0)","v":4},10,"Rossier","Yves-Alain",92,{"$f":"IFERROR((VLOOKUP(CONCATENATE(P14,Q14),Qui!$D$301:$F$356,3,0)),0)","v":4}]
[11,"Dubois","Eric",89,0,0,0,0,0,0,null,null,{"$f":"SUM(D15:L15*(D15:L15>=LARGE(D15:L15,Qui!$A$402)))","v":89},{"$f":"IFERROR((VLOOKUP(CONCATENATE(B15,C15),Qui!$D$301:$F$356,3,)),0)","v":1},11,"Dubois","Eric",89,{"$f":"IFERROR((VLOOKUP(CONCATENATE(P15,Q15),Qui!$D$301:$F$356,3,0)),0)","v":1}]
[12,"Rollat","Christian",86,0,0,0,0,0,0,null,null,{"$f":"SUM(D16:L16*(D16:L16>=LARGE(D16:L16,Qui!$A$402)))","v":86},{"$f":"IFERROR((VLOOKUP(CONCATENATE(B16,C16),Qui!$D$301:$F$356,3,)),0)","v":1},12,"Rollat","Christian",86,{"$f":"IFERROR((VLOOKUP(CONCATENATE(P16,Q16),Qui!$D$301:$F$356,3,0)),0)","v":1}]
[13,"Pellaton","Daniel",{"v":85.4,"d":"85"},0,0,0,0,0,0,null,null,{"$f":"SUM(D17:L17*(D17:L17>=LARGE(D17:L17,Qui!$A$402)))","v":{"v":85.4,"d":"85"}},{"$f":"IFERROR((VLOOKUP(CONCATENATE(B17,C17),Qui!$D$301:$F$356,3,)),0)","v":4},13,"Pellaton","Daniel",{"v":85.4,"d":"85"},{"$f":"IFERROR((VLOOKUP(CONCATENATE(P17,Q17),Qui!$D$301:$F$356,3,0)),0)","v":4}]
[14,"Frutiger","Bertrand",{"v":85.2,"d":"85"},0,0,0,0,0,0,null,null,{"$f":"SUM(D18:L18*(D18:L18>=LARGE(D18:L18,Qui!$A$402)))","v":{"v":85.2,"d":"85"}},{"$f":"IFERROR((VLOOKUP(CONCATENATE(B18,C18),Qui!$D$301:$F$356,3,)),0)","v":4},14,"Frutiger","Bertrand",{"v":85.2,"d":"85"},{"$f":"IFERROR((VLOOKUP(CONCATENATE(P18,Q18),Qui!$D$301:$F$356,3,0)),0)","v":4}]
[15,"Bourquin","Willy",85,0,0,0,0,0,0,null,null,{"$f":"SUM(D19:L19*(D19:L19>=LARGE(D19:L19,Qui!$A$402)))","v":85},{"$f":"IFERROR((VLOOKUP(CONCATENATE(B19,C19),Qui!$D$301:$F$356,3,)),0)","v":4},15,"Bourquin","Willy",85,{"$f":"IFERROR((VLOOKUP(CONCATENATE(P19,Q19),Qui!$D$301:$F$356,3,0)),0)","v":4}]
[16,"Bühler","Raymond",82,0,0,0,0,0,0,null,null,{"$f":"SUM(D20:L20*(D20:L20>=LARGE(D20:L20,Qui!$A$402)))","v":82},{"$f":"IFERROR((VLOOKUP(CONCATENATE(B20,C20),Qui!$D$301:$F$356,3,)),0)","v":0},16,"Bühler","Raymond",82,{"$f":"IFERROR((VLOOKUP(CONCATENATE(P20,Q20),Qui!$D$301:$F$356,3,0)),0)","v":0}]
[17,"Chassot","Yves",79,0,0,0,0,0,0,null,null,{"$f":"SUM(D21:L21*(D21:L21>=LARGE(D21:L21,Qui!$A$402)))","v":79},{"$f":"IFERROR((VLOOKUP(CONCATENATE(B21,C21),Qui!$D$301:$F$356,3,)),0)","v":2},17,"Chassot","Yves",79,{"$f":"IFERROR((VLOOKUP(CONCATENATE(P21,Q21),Qui!$D$301:$F$356,3,0)),0)","v":2}]
[18,"Aeschlimann","Loris",{"v":78.2,"d":"78"},0,0,0,0,0,0,null,null,{"$f":"SUM(D22:L22*(D22:L22>=LARGE(D22:L22,Qui!$A$402)))","v":{"v":78.2,"d":"78"}},{"$f":"IFERROR((VLOOKUP(CONCATENATE(B22,C22),Qui!$D$301:$F$356,3,)),0)","v":4},18,"Aeschlimann","Loris",{"v":78.2,"d":"78"},{"$f":"IFERROR((VLOOKUP(CONCATENATE(P22,Q22),Qui!$D$301:$F$356,3,0)),0)","v":4}]
[19,"Reichen","Sylvain",78,0,0,0,0,0,0,null,null,{"$f":"SUM(D23:L23*(D23:L23>=LARGE(D23:L23,Qui!$A$402)))","v":78},{"$f":"IFERROR((VLOOKUP(CONCATENATE(B23,C23),Qui!$D$301:$F$356,3,)),0)","v":4},19,"Reichen","Sylvain",78,{"$f":"IFERROR((VLOOKUP(CONCATENATE(P23,Q23),Qui!$D$301:$F$356,3,0)),0)","v":4}]
[20,"Haussener","Philippe",69,0,0,0,0,0,0,null,null,{"$f":"SUM(D24:L24*(D24:L24>=LARGE(D24:L24,Qui!$A$402)))","v":69},{"$f":"IFERROR((VLOOKUP(CONCATENATE(B24,C24),Qui!$D$301:$F$356,3,)),0)","v":2},20,"Haussener","Philippe",69,{"$f":"IFERROR((VLOOKUP(CONCATENATE(P24,Q24),Qui!$D$301:$F$356,3,0)),0)","v":2}]
[21,"Dubois","Emmanuel",67,0,0,0,0,0,0,null,null,{"$f":"SUM(D25:L25*(D25:L25>=LARGE(D25:L25,Qui!$A$402)))","v":67},{"$f":"IFERROR((VLOOKUP(CONCATENATE(B25,C25),Qui!$D$301:$F$356,3,)),0)","v":1},21,"Dubois","Emmanuel",67,{"$f":"IFERROR((VLOOKUP(CONCATENATE(P25,Q25),Qui!$D$301:$F$356,3,0)),0)","v":1}]
[22,"Matthey","Pierre",65,0,0,0,0,0,0,null,null,{"$f":"SUM(D26:L26*(D26:L26>=LARGE(D26:L26,Qui!$A$402)))","v":65},{"$f":"IFERROR((VLOOKUP(CONCATENATE(B26,C26),Qui!$D$301:$F$356,3,)),0)","v":1},22,"Matthey","Pierre",65,{"$f":"IFERROR((VLOOKUP(CONCATENATE(P26,Q26),Qui!$D$301:$F$356,3,0)),0)","v":1}]
[23,"Dubois","Marcel",53,0,0,0,0,0,0,null,null,{"$f":"SUM(D27:L27*(D27:L27>=LARGE(D27:L27,Qui!$A$402)))","v":53},{"$f":"IFERROR((VLOOKUP(CONCATENATE(B27,C27),Qui!$D$301:$F$356,3,)),0)","v":1},23,"Dubois","Marcel",53,{"$f":"IFERROR((VLOOKUP(CONCATENATE(P27,Q27),Qui!$D$301:$F$356,3,0)),0)","v":1}]
[24,"Jean-Mairet","Jean-Claude",51,0,0,0,0,0,0,null,null,{"$f":"SUM(D28:L28*(D28:L28>=LARGE(D28:L28,Qui!$A$402)))","v":51},{"$f":"IFERROR((VLOOKUP(CONCATENATE(B28,C28),Qui!$D$301:$F$356,3,)),0)","v":1},24,"Jean-Mairet","Jean-Claude",51,{"$f":"IFERROR((VLOOKUP(CONCATENATE(P28,Q28),Qui!$D$301:$F$356,3,0)),0)","v":1}]
[25,"Coppey","Romain",40,0,0,0,0,0,0,null,null,{"$f":"SUM(D29:L29*(D29:L29>=LARGE(D29:L29,Qui!$A$402)))","v":40},{"$f":"IFERROR((VLOOKUP(CONCATENATE(B29,C29),Qui!$D$301:$F$356,3,)),0)","v":0},25,"Coppey","Romain",40,{"$f":"IFERROR((VLOOKUP(CONCATENATE(P29,Q29),Qui!$D$301:$F$356,3,0)),0)","v":0}]
[26,"Rindlisbascher","Heinz",37,0,0,0,0,0,0,null,null,{"$f":"SUM(D30:L30*(D30:L30>=LARGE(D30:L30,Qui!$A$402)))","v":37},{"$f":"IFERROR((VLOOKUP(CONCATENATE(B30,C30),Qui!$D$301:$F$356,3,)),0)","v":0},26,"Rindlisbascher","Heinz",37,{"$f":"IFERROR((VLOOKUP(CONCATENATE(P30,Q30),Qui!$D$301:$F$356,3,0)),0)","v":0}]
[27,"Favre","Daniel",0,0,0,0,0,0,0,null,null,{"$f":"SUM(D31:L31*(D31:L31>=LARGE(D31:L31,Qui!$A$402)))","v":0},{"$f":"IFERROR((VLOOKUP(CONCATENATE(B31,C31),Qui!$D$301:$F$356,3,)),0)","v":3},27,"Favre","Daniel",0,{"$f":"IFERROR((VLOOKUP(CONCATENATE(P31,Q31),Qui!$D$301:$F$356,3,0)),0)","v":3}]
[28,"Cassi","Alain",0,0,0,0,0,0,0,null,null,{"$f":"SUM(D32:L32*(D32:L32>=LARGE(D32:L32,Qui!$A$402)))","v":0},{"$f":"IFERROR((VLOOKUP(CONCATENATE(B32,C32),Qui!$D$301:$F$356,3,)),0)","v":3},28,"Cassi","Alain",0,{"$f":"IFERROR((VLOOKUP(CONCATENATE(P32,Q32),Qui!$D$301:$F$356,3,0)),0)","v":3}]
[29,"Wäfler","Jean-Louis",0,0,0,0,0,0,0,null,null,{"$f":"SUM(D33:L33*(D33:L33>=LARGE(D33:L33,Qui!$A$402)))","v":0},{"$f":"IFERROR((VLOOKUP(CONCATENATE(B33,C33),Qui!$D$301:$F$356,3,)),0)","v":4},29,"Wäfler","Jean-Louis",0,{"$f":"IFERROR((VLOOKUP(CONCATENATE(P33,Q33),Qui!$D$301:$F$356,3,0)),0)","v":4}]
[30,"Kemajl","Fetahi",0,0,0,0,0,0,0,null,null,{"$f":"SUM(D34:L34*(D34:L34>=LARGE(D34:L34,Qui!$A$402)))","v":0},{"$f":"IFERROR((VLOOKUP(CONCATENATE(B34,C34),Qui!$D$301:$F$356,3,)),0)","v":3},30,"Kemajl","Fetahi",0,{"$f":"IFERROR((VLOOKUP(CONCATENATE(P34,Q34),Qui!$D$301:$F$356,3,0)),0)","v":3}]
[31,"Billod-Morel","Gérald",0,0,0,0,0,0,0,null,null,{"$f":"SUM(D35:L35*(D35:L35>=LARGE(D35:L35,Qui!$A$402)))","v":0},{"$f":"IFERROR((VLOOKUP(CONCATENATE(B35,C35),Qui!$D$301:$F$356,3,)),0)","v":1},31,"Billod-Morel","Gérald",0,{"$f":"IFERROR((VLOOKUP(CONCATENATE(P35,Q35),Qui!$D$301:$F$356,3,0)),0)","v":1}]
[32,"Voirol","Pierre",null,0,0,0,0,0,0,null,null,{"$f":"SUM(D36:L36*(D36:L36>=LARGE(D36:L36,Qui!$A$402)))","v":0},{"$f":"IFERROR((VLOOKUP(CONCATENATE(B36,C36),Qui!$D$301:$F$356,3,)),0)","v":1},32,"Voirol","Pierre",0,{"$f":"IFERROR((VLOOKUP(CONCATENATE(P36,Q36),Qui!$D$301:$F$356,3,0)),0)","v":1}]
[33,{"$nulls":3},0,0,0,0,0,0,null,null,{"$f":"SUM(D37:L37*(D37:L37>=LARGE(D37:L37,Qui!$A$402)))","v":0},{"$f":"IFERROR((VLOOKUP(CONCATENATE(B37,C37),Qui!$D$301:$F$356,3,)),0)","v":0},33,{"$nulls":3},{"$f":"IFERROR((VLOOKUP(CONCATENATE(P37,Q37),Qui!$D$301:$F$356,3,0)),0)","v":0}]
[34,{"$nulls":3},0,0,0,0,0,0,null,null,{"$f":"SUM(D38:L38*(D38:L38>=LARGE(D38:L38,Qui!$A$402)))","v":0},{"$f":"IFERROR((VLOOKUP(CONCATENATE(B38,C38),Qui!$D$301:$F$356,3,)),0)","v":0},34,{"$nulls":3},{"$f":"IFERROR((VLOOKUP(CONCATENATE(P38,Q38),Qui!$D$301:$F$356,3,0)),0)","v":0}]
[35,null,null,0,0,0,0,0,0,0,null,null,{"$f":"SUM(D39:L39*(D39:L39>=LARGE(D39:L39,Qui!$A$402)))","v":0},{"$f":"IFERROR((VLOOKUP(CONCATENATE(B39,C39),Qui!$D$301:$F$356,3,)),0)","v":0},35,{"$nulls":3},{"$f":"IFERROR((VLOOKUP(CONCATENATE(P39,Q39),Qui!$D$301:$F$356,3,0)),0)","v":0}]
[36,null,null,0,0,0,0,0,0,0,0,0,{"$f":"SUM(D40:L40*(D40:L40>=LARGE(D40:L40,Qui!$A$402)))","v":0},{"$f":"IFERROR((VLOOKUP(CONCATENATE(B40,C40),Qui!$D$301:$F$356,3,)),0)","v":0},36,null,null,0,{"$f":"IFERROR((VLOOKUP(CONCATENATE(P40,Q40),Qui!$D$301:$F$356,3,0)),0)","v":0}]
[37,null,null,0,0,0,0,0,0,0,0,0,{"$f":"SUM(D41:L41*(D41:L41>=LARGE(D41:L41,Qui!$A$402)))","v":0},{"$f":"IFERROR((VLOOKUP(CONCATENATE(B41,C41),Qui!$D$301:$F$356,3,)),0)","v":0},37,null,null,0,{"$f":"IFERROR((VLOOKUP(CONCATENATE(P41,Q41),Qui!$D$301:$F$356,3,0)),0)","v":0}]
[38,null,null,0,0,0,0,0,0,0,0,0,{"$f":"SUM(D42:L42*(D42:L42>=LARGE(D42:L42,Qui!$A$402)))","v":0},{"$f":"IFERROR((VLOOKUP(CONCATENATE(B42,C42),Qui!$D$301:$F$356,3,)),0)","v":0},38,null,null,0,{"$f":"IFERROR((VLOOKUP(CONCATENATE(P42,Q42),Qui!$D$301:$F$356,3,0)),0)","v":0}]
[39,null,null,0,0,0,0,0,0,0,0,0,{"$f":"SUM(D43:L43*(D43:L43>=LARGE(D43:L43,Qui!$A$402)))","v":0},{"$f":"IFERROR((VLOOKUP(CONCATENATE(B43,C43),Qui!$D$301:$F$356,3,)),0)","v":0},39,null,null,0,{"$f":"IFERROR((VLOOKUP(CONCATENATE(P43,Q43),Qui!$D$301:$F$356,3,0)),0)","v":0}]
[40,null,null,0,0,0,0,0,0,0,0,0,{"$f":"SUM(D44:L44*(D44:L44>=LARGE(D44:L44,Qui!$A$402)))","v":0},{"$f":"IFERROR((VLOOKUP(CONCATENATE(B44,C44),Qui!$D$301:$F$356,3,)),0)","v":0},40,null,null,0,{"$f":"IFERROR((VLOOKUP(CONCATENATE(P44,Q44),Qui!$D$301:$F$356,3,0)),0)","v":0}]
[41,null,null,0,0,0,0,0,0,0,0,0,{"$f":"SUM(D45:L45*(D45:L45>=LARGE(D45:L45,Qui!$A$402)))","v":0},{"$f":"IFERROR((VLOOKUP(CONCATENATE(B45,C45),Qui!$D$301:$F$356,3,)),0)","v":0},41,null,null,0,{"$f":"IFERROR((VLOOKUP(CONCATENATE(P45,Q45),Qui!$D$301:$F$356,3,0)),0)","v":0}]
[42,null,null,0,0,0,0,0,0,0,0,0,{"$f":"SUM(D46:L46*(D46:L46>=LARGE(D46:L46,Qui!$A$402)))","v":0},{"$f":"IFERROR((VLOOKUP(CONCATENATE(B46,C46),Qui!$D$301:$F$356,3,)),0)","v":0},42,null,null,0,{"$f":"IFERROR((VLOOKUP(CONCATENATE(P46,Q46),Qui!$D$301:$F$356,3,0)),0)","v":0}]
[43,null,null,0,0,0,0,0,0,0,0,0,{"$f":"SUM(D47:L47*(D47:L47>=LARGE(D47:L47,Qui!$A$402)))","v":0},{"$f":"IFERROR((VLOOKUP(CONCATENATE(B47,C47),Qui!$D$301:$F$356,3,)),0)","v":0},43,null,null,0,{"$f":"IFERROR((VLOOKUP(CONCATENATE(P47,Q47),Qui!$D$301:$F$356,3,0)),0)","v":0}]
[44,null,null,0,0,0,0,0,0,0,0,0,{"$f":"SUM(D48:L48*(D48:L48>=LARGE(D48:L48,Qui!$A$402)))","v":0},{"$f":"IFERROR((VLOOKUP(CONCATENATE(B48,C48),Qui!$D$301:$F$356,3,)),0)","v":0},44,null,null,0,{"$f":"IFERROR((VLOOKUP(CONCATENATE(P48,Q48),Qui!$D$301:$F$356,3,0)),0)","v":0}]
[45,null,null,0,0,0,0,0,0,0,0,0,{"$f":"SUM(D49:L49*(D49:L49>=LARGE(D49:L49,Qui!$A$402)))","v":0},{"$f":"IFERROR((VLOOKUP(CONCATENATE(B49,C49),Qui!$D$301:$F$356,3,)),0)","v":0},45,null,null,0,{"$f":"IFERROR((VLOOKUP(CONCATENATE(P49,Q49),Qui!$D$301:$F$356,3,0)),0)","v":0}]
[46,null,null,0,0,0,0,0,0,0,0,0,{"$f":"SUM(D50:L50*(D50:L50>=LARGE(D50:L50,Qui!$A$402)))","v":0},{"$f":"IFERROR((VLOOKUP(CONCATENATE(B50,C50),Qui!$D$301:$F$356,3,)),0)","v":0},46,null,null,0,{"$f":"IFERROR((VLOOKUP(CONCATENATE(P50,Q50),Qui!$D$301:$F$356,3,0)),0)","v":0}]
[47,null,null,0,0,0,0,0,0,0,0,0,{"$f":"SUM(D51:L51*(D51:L51>=LARGE(D51:L51,Qui!$A$402)))","v":0},{"$f":"IFERROR((VLOOKUP(CONCATENATE(B51,C51),Qui!$D$301:$F$356,3,)),0)","v":0},47,null,null,0,{"$f":"IFERROR((VLOOKUP(CONCATENATE(P51,Q51),Qui!$D$301:$F$356,3,0)),0)","v":0}]
[48,null,null,0,0,0,0,0,0,0,0,0,{"$f":"SUM(D52:L52*(D52:L52>=LARGE(D52:L52,Qui!$A$402)))","v":0},{"$f":"IFERROR((VLOOKUP(CONCATENATE(B52,C52),Qui!$D$301:$F$356,3,)),0)","v":0},48,null,null,0,{"$f":"IFERROR((VLOOKUP(CONCATENATE(P52,Q52),Qui!$D$301:$F$356,3,0)),0)","v":0}]
[49,null,null,0,0,0,0,0,0,0,0,0,{"$f":"SUM(D53:L53*(D53:L53>=LARGE(D53:L53,Qui!$A$402)))","v":0},{"$f":"IFERROR((VLOOKUP(CONCATENATE(B53,C53),Qui!$D$301:$F$356,3,)),0)","v":0},49,null,null,0,{"$f":"IFERROR((VLOOKUP(CONCATENATE(P53,Q53),Qui!$D$301:$F$356,3,0)),0)","v":0}]
[50,null,null,0,0,0,0,0,0,0,0,0,{"$f":"SUM(D54:L54*(D54:L54>=LARGE(D54:L54,Qui!$A$402)))","v":0},{"$f":"IFERROR((VLOOKUP(CONCATENATE(B54,C54),Qui!$D$301:$F$356,3,)),0)","v":0},50,null,null,0,{"$f":"IFERROR((VLOOKUP(CONCATENATE(P54,Q54),Qui!$D$301:$F$356,3,0)),0)","v":0}]
[51,null,null,0,0,0,0,0,0,0,0,0,{"$f":"SUM(D55:L55*(D55:L55>=LARGE(D55:L55,Qui!$A$402)))","v":0},{"$f":"IFERROR((VLOOKUP(CONCATENATE(B55,C55),Qui!$D$301:$F$356,3,)),0)","v":0},51,null,null,0,{"$f":"IFERROR((VLOOKUP(CONCATENATE(P55,Q55),Qui!$D$301:$F$356,3,0)),0)","v":0}]
[52,null,null,0,0,0,0,0,0,0,0,0,{"$f":"SUM(D56:L56*(D56:L56>=LARGE(D56:L56,Qui!$A$402)))","v":0},{"$f":"IFERROR((VLOOKUP(CONCATENATE(B56,C56),Qui!$D$301:$F$356,3,)),0)","v":0},52,null,null,0,{"$f":"IFERROR((VLOOKUP(CONCATENATE(P56,Q56),Qui!$D$301:$F$356,3,0)),0)","v":0}]
[53,null,null,0,0,0,0,0,0,0,0,0,{"$f":"SUM(D57:L57*(D57:L57>=LARGE(D57:L57,Qui!$A$402)))","v":0},{"$f":"IFERROR((VLOOKUP(CONCATENATE(B57,C57),Qui!$D$301:$F$356,3,)),0)","v":0},53,null,null,0,{"$f":"IFERROR((VLOOKUP(CONCATENATE(P57,Q57),Qui!$D$301:$F$356,3,0)),0)","v":0}]
[54,null,null,0,0,0,0,0,0,0,0,0,{"$f":"SUM(D58:L58*(D58:L58>=LARGE(D58:L58,Qui!$A$402)))","v":0},{"$f":"IFERROR((VLOOKUP(CONCATENATE(B58,C58),Qui!$D$301:$F$356,3,)),0)","v":0},54,null,null,0,{"$f":"IFERROR((VLOOKUP(CONCATENATE(P58,Q58),Qui!$D$301:$F$356,3,0)),0)","v":0}]
[{"$nulls":3},{"$f":"MAX(D5:D58)","v":118},null,{"$f":"MAX(F5:F58)","v":0},{"$f":"MAX(G5:G58)","v":0},null,{"$f":"MAX(I5:I58)","v":0},{"$f":"MAX(J5:J58)","v":0},{"$f":"MAX(K5:K58)","v":0},{"$f":"MAX(L5:L58)","v":0}]
["Classement général par équipe",{"$nulls":13},"Classement par équipe"]
[]
[1,"La Vue-des-Alpes",null,480,{"$nulls":8},{"$f":"SUM(D62:L62)","v":480},{"$f":"VLOOKUP(B62,Qui!$A$201:$D$204,4)","v":2},1,"La Vue-des-Alpes",null,{"$f":"SUMPRODUCT(((($S$5:$S$58=S62)*$R$5:$R$58*1))*((($S$5:$S$58=S62)*$R$5:$R$58*1)>=LARGE((($S$5:$S$58=S62)*$R$5:$R$58*1),Qui!$B$402)))","v":480},{"$f":"VLOOKUP(P62,Qui!$A$201:$D$204,4)","v":2}]
[2,"L'Epi",null,457.59999999999997,{"$nulls":8},{"$f":"SUM(D63:L63)","v":{"v":457.59999999999997,"d":"458"}},{"$f":"VLOOKUP(B63,Qui!$A$201:$D$204,4)","v":4},2,"L'Epi",null,{"$f":"SUMPRODUCT(((($S$5:$S$58=S63)*$R$5:$R$58*1))*((($S$5:$S$58=S63)*$R$5:$R$58*1)>=LARGE((($S$5:$S$58=S63)*$R$5:$R$58*1),Qui!$B$402)))","v":{"v":457.59999999999997,"d":"458"}},{"$f":"VLOOKUP(P63,Qui!$A$201:$D$204,4)","v":4}]
[3,"La Chaux-de-Fonds",null,442,{"$nulls":8},{"$f":"SUM(D64:L64)","v":442},{"$f":"VLOOKUP(B64,Qui!$A$201:$D$204,4)","v":1},3,"La Chaux-de-Fonds",null,{"$f":"SUMPRODUCT(((($S$5:$S$58=S64)*$R$5:$R$58*1))*((($S$5:$S$58=S64)*$R$5:$R$58*1)>=LARGE((($S$5:$S$58=S64)*$R$5:$R$58*1),Qui!$B$402)))","v":442},{"$f":"VLOOKUP(P64,Qui!$A$201:$D$204,4)","v":1}]
[4,"Le Locle",null,228.2,{"$nulls":8},{"$f":"SUM(D65:L65)","v":{"v":228.2,"d":"228"}},{"$f":"VLOOKUP(B65,Qui!$A$201:$D$204,4)","v":3},4,"Le Locle",null,{"$f":"SUMPRODUCT(((($S$5:$S$58=S65)*$R$5:$R$58*1))*((($S$5:$S$58=S65)*$R$5:$R$58*1)>=LARGE((($S$5:$S$58=S65)*$R$5:$R$58*1),Qui!$B$402)))","v":{"v":228.2,"d":"228"}},{"$f":"VLOOKUP(P65,Qui!$A$201:$D$204,4)","v":3}]
[5,null,null,{"$error":"#N/A"},{"$nulls":8},{"$f":"SUM(D66:L66)","v":{"$error":"#N/A"}},{"$f":"VLOOKUP(B66,Qui!$A$201:$D$204,4)","v":{"$error":"#N/A"}},5,null,null,{"$f":"SUMPRODUCT(((($S$5:$S$58=S66)*$R$5:$R$58*1))*((($S$5:$S$58=S66)*$R$5:$R$58*1)>=LARGE((($S$5:$S$58=S66)*$R$5:$R$58*1),Qui!$B$402)))","v":{"$error":"#N/A"}},{"$f":"VLOOKUP(P66,Qui!$A$201:$D$204,4)","v":{"$error":"#N/A"}}]
[6,null,null,{"$error":"#N/A"},{"$nulls":8},{"$error":"#N/A"},{"$f":"VLOOKUP(B67,Qui!$A$201:$D$204,4)","v":{"$error":"#N/A"}},6,null,null,{"$f":"SUMPRODUCT(((($S$5:$S$58=S67)*$R$5:$R$58*1))*((($S$5:$S$58=S67)*$R$5:$R$58*1)>=LARGE((($S$5:$S$58=S67)*$R$5:$R$58*1),Qui!$B$402)))","v":{"$error":"#N/A"}},{"$f":"VLOOKUP(P67,Qui!$A$201:$D$204,4)","v":{"$error":"#N/A"}}]
[{"$nulls":3},{"$f":"MAX(D62:D67)","v":{"$error":"#N/A"}},null,{"$f":"MAX(F62:F67)","v":0},{"$f":"MAX(G62:G67)","v":0},null,{"$f":"MAX(I62:I67)","v":0},{"$f":"MAX(J62:J67)","v":0},{"$f":"MAX(K62:K67)","v":0},{"$f":"MAX(L62:L67)","v":0},{"$nulls":5},0]
[{"$nulls":12},"La Chaux-de-Fonds, le 2023 / CM"]
[]
[null,{"$f":"CONCATENATE(\"Rappels :\")","v":"Rappels :"}]
[]
[null,{"$f":"CONCATENATE(\"a) le classement général par équipe  est fait sur le cumul des \",Qui!$B$402,\" meilleurs résultats individuels de chaque manche\")","v":"a) le classement général par équipe  est fait sur le cumul des 5 meilleurs résultats individuels de chaque manche"}]
[null,{"$f":"CONCATENATE(\"b) le classement général individuel est fait sur le cumul des \",Qui!$A$402,\" meilleurs résultats individuels\")","v":"b) le classement général individuel est fait sur le cumul des 5 meilleurs résultats individuels"}]

{"sheet":"Manche_2","index":4,"n_rows":74,"n_cols":21,"rows_kept":74,"hidden":true,"merged":[[0,0,0,17],[1,0,1,17],[2,0,2,1],[2,15,2,17],[3,15,3,17],[60,1,60,2],[60,15,60,16],[67,1,67,2],[68,12,68,17],[70,1,70,17],[71,1,71,17],[72,1,72,17],[73,1,73,17]]}
["Association intercantonale \ndes joueurs de boules\nGrand Jeu Neuchâtelois"]
[{"$f":"CONCATENATE(\"Championnat grand jeu neuchâtelois \",YEAR(Calendrier!B6))","v":"Championnat grand jeu neuchâtelois 2024"}]
["Classement général individuel",null,"Manches",{"$f":"Calendrier!F40","v":"Grand-Sommartel"},{"$f":"Calendrier!F47","v":"Le Locle"},{"$f":"Calendrier!F54","v":"Evologia"},{"$f":"Calendrier!F61","v":"La  Vue-des-Alpes"},{"$f":"Calendrier!F68","v":"L'Epi"},{"$f":"Calendrier!F75","v":"La  Chaux-de-Fonds"},{"$f":"Calendrier!F82","v":"00:00:00"},null,null,{"$f":"CONCATENATE(\"Général\",CHAR(10),\"les \",Qui!$A$402,\" meilleurs\")","v":"Général\nles 5 meilleurs"},null,null,{"$f":"CONCATENATE(\"Classement de la manche\",CHAR(10),Calendrier!F47,CHAR(10),\"du\",TEXT(Calendrier!F49,\" jj.mm\"),\" au\",TEXT(Calendrier!F52,\" jj.mm.aaaa\"))","v":"Classement de la manche\nLe Locle\ndu 09.09 au 12.09.2024"},{"$nulls":4},{"$f":"CONCATENATE(TEXT(Calendrier!F49,\" jj.mm\"),\" au\",TEXT(Calendrier!F52,\" jj.mm.aaaa\"))","v":" 09.09 au 12.09.2024"}]
[{"$nulls":3},1,2,3,4,5,6,7,8,9,{"$nulls":3},{"$f":"CONCATENATE(\"Champion de jeu : \",CHAR(10),P5,\" \",Q5)","v":"Champion de jeu : \nBart Fabien"}]
[1,"Bart","Fabien",118,0,0,0,0,0,0,null,null,{"$f":"SUM(D5:L5*(D5:L5>=LARGE(D5:L5,Qui!$A$402)))","v":118},{"$f":"IFERROR((VLOOKUP(CONCATENATE(B5,C5),Qui!$D$301:$F$356,3,)),0)","v":3},1,"Bart","Fabien",109,{"$f":"IFERROR((VLOOKUP(CONCATENATE(P5,Q5),Qui!$D$301:$F$356,3,0)),0)","v":3}]
[2,"Tynowski","Lucien",{"v":110.2,"d":"110"},0,0,0,0,0,0,null,null,{"$f":"SUM(D6:L6*(D6:L6>=LARGE(D6:L6,Qui!$A$402)))","v":{"v":110.2,"d":"110"}},{"$f":"IFERROR((VLOOKUP(CONCATENATE(B6,C6),Qui!$D$301:$F$356,3,)),0)","v":3},2,"Tynowski","Lucien",117,{"$f":"IFERROR((VLOOKUP(CONCATENATE(P6,Q6),Qui!$D$301:$F$356,3,0)),0)","v":3}]
[3,"Mores","Blaise",110,0,0,0,0,0,0,null,null,{"$f":"SUM(D7:L7*(D7:L7>=LARGE(D7:L7,Qui!$A$402)))","v":110},{"$f":"IFERROR((VLOOKUP(CONCATENATE(B7,C7),Qui!$D$301:$F$356,3,)),0)","v":4},3,"Mores","Blaise",100,{"$f":"IFERROR((VLOOKUP(CONCATENATE(P7,Q7),Qui!$D$301:$F$356,3,0)),0)","v":4}]
[4,"Vuillème","Claude-Alain",107,0,0,0,0,0,0,null,null,{"$f":"SUM(D8:L8*(D8:L8>=LARGE(D8:L8,Qui!$A$402)))","v":107},{"$f":"IFERROR((VLOOKUP(CONCATENATE(B8,C8),Qui!$D$301:$F$356,3,)),0)","v":2},4,"Vuillème","Claude-Alain",{"v":69.01,"d":"69"},{"$f":"IFERROR((VLOOKUP(CONCATENATE(P8,Q8),Qui!$D$301:$F$356,3,0)),0)","v":2}]
[5,"Voirol","Pierre",104,0,0,0,0,0,0,null,null,{"$f":"SUM(D9:L9*(D9:L9>=LARGE(D9:L9,Qui!$A$402)))","v":104},{"$f":"IFERROR((VLOOKUP(CONCATENATE(B9,C9),Qui!$D$301:$F$356,3,)),0)","v":1},5,"Voirol","Pierre",111,{"$f":"IFERROR((VLOOKUP(CONCATENATE(P9,Q9),Qui!$D$301:$F$356,3,0)),0)","v":1}]
[6,"Dick","Pierre-Alain",99,0,0,0,0,0,0,null,null,{"$f":"SUM(D10:L10*(D10:L10>=LARGE(D10:L10,Qui!$A$402)))","v":99},{"$f":"IFERROR((VLOOKUP(CONCATENATE(B10,C10),Qui!$D$301:$F$356,3,)),0)","v":2},6,"Dick","Pierre-Alain",93,{"$f":"IFERROR((VLOOKUP(CONCATENATE(P10,Q10),Qui!$D$301:$F$356,3,0)),0)","v":2}]
[7,"Jeanneret","Louis",98,0,0,0,0,0,0,null,null,{"$f":"SUM(D11:L11*(D11:L11>=LARGE(D11:L11,Qui!$A$402)))","v":98},{"$f":"IFERROR((VLOOKUP(CONCATENATE(B11,C11),Qui!$D$301:$F$356,3,)),0)","v":2},7,"Jeanneret","Louis",{"v":95.01,"d":"95"},{"$f":"IFERROR((VLOOKUP(CONCATENATE(P11,Q11),Qui!$D$301:$F$356,3,0)),0)","v":2}]
[8,"Oppliger","Hervé",97,0,0,0,0,0,0,null,null,{"$f":"SUM(D12:L12*(D12:L12>=LARGE(D12:L12,Qui!$A$402)))","v":97},{"$f":"IFERROR((VLOOKUP(CONCATENATE(B12,C12),Qui!$D$301:$F$356,3,)),0)","v":2},8,"Oppliger","Hervé",70,{"$f":"IFERROR((VLOOKUP(CONCATENATE(P12,Q12),Qui!$D$301:$F$356,3,0)),0)","v":2}]
[9,"Monnier","Christian",96,0,0,0,0,0,0,null,null,{"$f":"SUM(D13:L13*(D13:L13>=LARGE(D13:L13,Qui!$A$402)))","v":96},{"$f":"IFERROR((VLOOKUP(CONCATENATE(B13,C13),Qui!$D$301:$F$356,3,)),0)","v":1},9,"Monnier","Christian",95,{"$f":"IFERROR((VLOOKUP(CONCATENATE(P13,Q13),Qui!$D$301:$F$356,3,0)),0)","v":1}]
[10,"Rossier","Yves-Alain",92,0,0,0,0,0,0,null,null,{"$f":"SUM(D14:L14*(D14:L14>=LARGE(D14:L14,Qui!$A$402)))","v":92},{"$f":"IFERROR((VLOOKUP(CONCATENATE(B14,C14),Qui!$D$301:$F$356,3,)),0)","v":4},10,"Rossier","Yves-Alain",84,{"$f":"IFERROR((VLOOKUP(CONCATENATE(P14,Q14),Qui!$D$301:$F$356,3,0)),0)","v":4}]
[11,"Dubois","Eric",89,0,0,0,0,0,0,null,null,{"$f":"SUM(D15:L15*(D15:L15>=LARGE(D15:L15,Qui!$A$402)))","v":89},{"$f":"IFERROR((VLOOKUP(CONCATENATE(B15,C15),Qui!$D$301:$F$356,3,)),0)","v":1},11,"Dubois","Eric",89,{"$f":"IFERROR((VLOOKUP(CONCATENATE(P15,Q15),Qui!$D$301:$F$356,3,0)),0)","v":1}]
[12,"Rollat","Christian",86,0,0,0,0,0,0,null,null,{"$f":"SUM(D16:L16*(D16:L16>=LARGE(D16:L16,Qui!$A$402)))","v":86},{"$f":"IFERROR((VLOOKUP(CONCATENATE(B16,C16),Qui!$D$301:$F$356,3,)),0)","v":1},12,"Rollat","Christian","0+",{"$f":"IFERROR((VLOOKUP(CONCATENATE(P16,Q16),Qui!$D$301:$F$356,3,0)),0)","v":1}]
[13,"Pellaton","Daniel",{"v":85.4,"d":"85"},0,0,0,0,0,0,null,null,{"$f":"SUM(D17:L17*(D17:L17>=LARGE(D17:L17,Qui!$A$402)))","v":{"v":85.4,"d":"85"}},{"$f":"IFERROR((VLOOKUP(CONCATENATE(B17,C17),Qui!$D$301:$F$356,3,)),0)","v":4},13,"Pellaton","Daniel",85,{"$f":"IFERROR((VLOOKUP(CONCATENATE(P17,Q17),Qui!$D$301:$F$356,3,0)),0)","v":4}]
[14,"Frutiger","Bertrand",{"v":85.2,"d":"85"},0,0,0,0,0,0,null,null,{"$f":"SUM(D18:L18*(D18:L18>=LARGE(D18:L18,Qui!$A$402)))","v":{"v":85.2,"d":"85"}},{"$f":"IFERROR((VLOOKUP(CONCATENATE(B18,C18),Qui!$D$301:$F$356,3,)),0)","v":4},14,"Frutiger","Bertrand",76,{"$f":"IFERROR((VLOOKUP(CONCATENATE(P18,Q18),Qui!$D$301:$F$356,3,0)),0)","v":4}]
[15,"Bourquin","Willy",85,0,0,0,0,0,0,null,null,{"$f":"SUM(D19:L19*(D19:L19>=LARGE(D19:L19,Qui!$A$402)))","v":85},{"$f":"IFERROR((VLOOKUP(CONCATENATE(B19,C19),Qui!$D$301:$F$356,3,)),0)","v":4},15,"Bourquin","Willy",44,{"$f":"IFERROR((VLOOKUP(CONCATENATE(P19,Q19),Qui!$D$301:$F$356,3,0)),0)","v":4}]
[16,"Bühler","Raymond",82,0,0,0,0,0,0,null,null,{"$f":"SUM(D20:L20*(D20:L20>=LARGE(D20:L20,Qui!$A$402)))","v":82},{"$f":"IFERROR((VLOOKUP(CONCATENATE(B20,C20),Qui!$D$301:$F$356,3,)),0)","v":0},16,"Bühler","Raymond",69,{"$f":"IFERROR((VLOOKUP(CONCATENATE(P20,Q20),Qui!$D$301:$F$356,3,0)),0)","v":0}]
[17,"Chassot","Yves",79,0,0,0,0,0,0,null,null,{"$f":"SUM(D21:L21*(D21:L21>=LARGE(D21:L21,Qui!$A$402)))","v":79},{"$f":"IFERROR((VLOOKUP(CONCATENATE(B21,C21),Qui!$D$301:$F$356,3,)),0)","v":2},17,"Chassot","Yves",72,{"$f":"IFERROR((VLOOKUP(CONCATENATE(P21,Q21),Qui!$D$301:$F$356,3,0)),0)","v":2}]
[18,"Aeschlimann","Loris",{"v":78.2,"d":"78"},0,0,0,0,0,0,null,null,{"$f":"SUM(D22:L22*(D22:L22>=LARGE(D22:L22,Qui!$A$402)))","v":{"v":78.2,"d":"78"}},{"$f":"IFERROR((VLOOKUP(CONCATENATE(B22,C22),Qui!$D$301:$F$356,3,)),0)","v":4},18,"Aeschlimann","Loris",51,{"$f":"IFERROR((VLOOKUP(CONCATENATE(P22,Q22),Qui!$D$301:$F$356,3,0)),0)","v":4}]
[19,"Reichen","Sylvain",78,0,0,0,0,0,0,null,null,{"$f":"SUM(D23:L23*(D23:L23>=LARGE(D23:L23,Qui!$A$402)))","v":78},{"$f":"IFERROR((VLOOKUP(CONCATENATE(B23,C23),Qui!$D$301:$F$356,3,)),0)","v":4},19,"Reichen","Sylvain",75,{"$f":"IFERROR((VLOOKUP(CONCATENATE(P23,Q23),Qui!$D$301:$F$356,3,0)),0)","v":4}]
[20,"Haussener","Philippe",69,0,0,0,0,0,0,null,null,{"$f":"SUM(D24:L24*(D24:L24>=LARGE(D24:L24,Qui!$A$402)))","v":69},{"$f":"IFERROR((VLOOKUP(CONCATENATE(B24,C24),Qui!$D$301:$F$356,3,)),0)","v":2},20,"Haussener","Philippe",0,{"$f":"IFERROR((VLOOKUP(CONCATENATE(P24,Q24),Qui!$D$301:$F$356,3,0)),0)","v":2}]
[21,"Dubois","Emmanuel",67,0,0,0,0,0,0,null,null,{"$f":"SUM(D25:L25*(D25:L25>=LARGE(D25:L25,Qui!$A$402)))","v":67},{"$f":"IFERROR((VLOOKUP(CONCATENATE(B25,C25),Qui!$D$301:$F$356,3,)),0)","v":1},21,"Dubois","Emmanuel",0,{"$f":"IFERROR((VLOOKUP(CONCATENATE(P25,Q25),Qui!$D$301:$F$356,3,0)),0)","v":1}]
[22,"Matthey","Pierre",65,0,0,0,0,0,0,null,null,{"$f":"SUM(D26:L26*(D26:L26>=LARGE(D26:L26,Qui!$A$402)))","v":65},{"$f":"IFERROR((VLOOKUP(CONCATENATE(B26,C26),Qui!$D$301:$F$356,3,)),0)","v":1},22,"Matthey","Pierre",91,{"$f":"IFERROR((VLOOKUP(CONCATENATE(P26,Q26),Qui!$D$301:$F$356,3,0)),0)","v":1}]
[23,"Dubois","Marcel",53,0,0,0,0,0,0,null,null,{"$f":"SUM(D27:L27*(D27:L27>=LARGE(D27:L27,Qui!$A$402)))","v":53},{"$f":"IFERROR((VLOOKUP(CONCATENATE(B27,C27),Qui!$D$301:$F$356,3,)),0)","v":1},23,"Dubois","Marcel",46,{"$f":"IFERROR((VLOOKUP(CONCATENATE(P27,Q27),Qui!$D$301:$F$356,3,0)),0)","v":1}]
[24,"Jean-Mairet","Jean-Claude",51,0,0,0,0,0,0,null,null,{"$f":"SUM(D28:L28*(D28:L28>=LARGE(D28:L28,Qui!$A$402)))","v":51},{"$f":"IFERROR((VLOOKUP(CONCATENATE(B28,C28),Qui!$D$301:$F$356,3,)),0)","v":1},24,"Jean-Mairet","Jean-Claude",21,{"$f":"IFERROR((VLOOKUP(CONCATENATE(P28,Q28),Qui!$D$301:$F$356,3,0)),0)","v":1}]
[25,"Coppet","Romain",40,0,0,0,0,0,0,null,null,{"$f":"SUM(D29:L29*(D29:L29>=LARGE(D29:L29,Qui!$A$402)))","v":40},{"$f":"IFERROR((VLOOKUP(CONCATENATE(B29,C29),Qui!$D$301:$F$356,3,)),0)","v":3},25,"Coppet","Romain",55,{"$f":"IFERROR((VLOOKUP(CONCATENATE(P29,Q29),Qui!$D$301:$F$356,3,0)),0)","v":3}]
[26,"Rindlisbacher","Heinz",37,0,0,0,0,0,0,null,null,{"$f":"SUM(D30:L30*(D30:L30>=LARGE(D30:L30,Qui!$A$402)))","v":37},{"$f":"IFERROR((VLOOKUP(CONCATENATE(B30,C30),Qui!$D$301:$F$356,3,)),0)","v":4},26,"Rindlisbacher","Heinz",0,{"$f":"IFERROR((VLOOKUP(CONCATENATE(P30,Q30),Qui!$D$301:$F$356,3,0)),0)","v":4}]
[27,"Favre","Daniel",0,0,0,0,0,0,0,null,null,{"$f":"SUM(D31:L31*(D31:L31>=LARGE(D31:L31,Qui!$A$402)))","v":0},{"$f":"IFERROR((VLOOKUP(CONCATENATE(B31,C31),Qui!$D$301:$F$356,3,)),0)","v":3},27,"Favre","Daniel",112,{"$f":"IFERROR((VLOOKUP(CONCATENATE(P31,Q31),Qui!$D$301:$F$356,3,0)),0)","v":3}]
[28,"Cassi","Alain",0,0,0,0,0,0,0,null,null,{"$f":"SUM(D32:L32*(D32:L32>=LARGE(D32:L32,Qui!$A$402)))","v":0},{"$f":"IFERROR((VLOOKUP(CONCATENATE(B32,C32),Qui!$D$301:$F$356,3,)),0)","v":3},28,"Cassi","Alain",0,{"$f":"IFERROR((VLOOKUP(CONCATENATE(P32,Q32),Qui!$D$301:$F$356,3,0)),0)","v":3}]
[29,"Wäfler","Jean-Louis",0,0,0,0,0,0,0,null,null,{"$f":"SUM(D33:L33*(D33:L33>=LARGE(D33:L33,Qui!$A$402)))","v":0},{"$f":"IFERROR((VLOOKUP(CONCATENATE(B33,C33),Qui!$D$301:$F$356,3,)),0)","v":4},29,"Wäfler","Jean-Louis",0,{"$f":"IFERROR((VLOOKUP(CONCATENATE(P33,Q33),Qui!$D$301:$F$356,3,0)),0)","v":4}]
[30,"Kemajl","Fetahi",0,0,0,0,0,0,0,null,null,{"$f":"SUM(D34:L34*(D34:L34>=LARGE(D34:L34,Qui!$A$402)))","v":0},{"$f":"IFERROR((VLOOKUP(CONCATENATE(B34,C34),Qui!$D$301:$F$356,3,)),0)","v":3},30,"Kemajl","Fetahi",106,{"$f":"IFERROR((VLOOKUP(CONCATENATE(P34,Q34),Qui!$D$301:$F$356,3,0)),0)","v":3}]
[31,"Billod-Morel","Gérald",0,0,0,0,0,0,0,null,null,{"$f":"SUM(D35:L35*(D35:L35>=LARGE(D35:L35,Qui!$A$402)))","v":0},{"$f":"IFERROR((VLOOKUP(CONCATENATE(B35,C35),Qui!$D$301:$F$356,3,)),0)","v":1},31,null,null,0,{"$f":"IFERROR((VLOOKUP(CONCATENATE(P35,Q35),Qui!$D$301:$F$356,3,0)),0)","v":0}]
[32,{"$nulls":3},0,0,0,0,0,0,null,null,{"$f":"SUM(D36:L36*(D36:L36>=LARGE(D36:L36,Qui!$A$402)))","v":0},{"$f":"IFERROR((VLOOKUP(CONCATENATE(B36,C36),Qui!$D$301:$F$356,3,)),0)","v":0},32,null,null,0,{"$f":"IFERROR((VLOOKUP(CONCATENATE(P36,Q36),Qui!$D$301:$F$356,3,0)),0)","v":0}]
[33,{"$nulls":3},0,0,0,0,0,0,null,null,{"$f":"SUM(D37:L37*(D37:L37>=LARGE(D37:L37,Qui!$A$402)))","v":0},{"$f":"IFERROR((VLOOKUP(CONCATENATE(B37,C37),Qui!$D$301:$F$356,3,)),0)","v":0},33,null,null,0,{"$f":"IFERROR((VLOOKUP(CONCATENATE(P37,Q37),Qui!$D$301:$F$356,3,0)),0)","v":0}]
[34,{"$nulls":3},0,0,0,0,0,0,null,null,{"$f":"SUM(D38:L38*(D38:L38>=LARGE(D38:L38,Qui!$A$402)))","v":0},{"$f":"IFERROR((VLOOKUP(CONCATENATE(B38,C38),Qui!$D$301:$F$356,3,)),0)","v":0},34,null,null,0,{"$f":"IFERROR((VLOOKUP(CONCATENATE(P38,Q38),Qui!$D$301:$F$356,3,0)),0)","v":0}]
[35,null,null,0,0,0,0,0,0,0,null,null,{"$f":"SUM(D39:L39*(D39:L39>=LARGE(D39:L39,Qui!$A$402)))","v":0},{"$f":"IFERROR((VLOOKUP(CONCATENATE(B39,C39),Qui!$D$301:$F$356,3,)),0)","v":0},35,null,null,0,{"$f":"IFERROR((VLOOKUP(CONCATENATE(P39,Q39),Qui!$D$301:$F$356,3,0)),0)","v":0}]
[36,null,null,0,0,0,0,0,0,0,0,0,{"$f":"SUM(D40:L40*(D40:L40>=LARGE(D40:L40,Qui!$A$402)))","v":0},{"$f":"IFERROR((VLOOKUP(CONCATENATE(B40,C40),Qui!$D$301:$F$356,3,)),0)","v":0},36,null,null,0,{"$f":"IFERROR((VLOOKUP(CONCATENATE(P40,Q40),Qui!$D$301:$F$356,3,0)),0)","v":0}]
[37,null,null,0,0,0,0,0,0,0,0,0,{"$f":"SUM(D41:L41*(D41:L41>=LARGE(D41:L41,Qui!$A$402)))","v":0},{"$f":"IFERROR((VLOOKUP(CONCATENATE(B41,C41),Qui!$D$301:$F$356,3,)),0)","v":0},37,null,null,0,{"$f":"IFERROR((VLOOKUP(CONCATENATE(P41,Q41),Qui!$D$301:$F$356,3,0)),0)","v":0}]
[38,null,null,0,0,0,0,0,0,0,0,0,{"$f":"SUM(D42:L42*(D42:L42>=LARGE(D42:L42,Qui!$A$402)))","v":0},{"$f":"IFERROR((VLOOKUP(CONCATENATE(B42,C42),Qui!$D$301:$F$356,3,)),0)","v":0},38,null,null,0,{"$f":"IFERROR((VLOOKUP(CONCATENATE(P42,Q42),Qui!$D$301:$F$356,3,0)),0)","v":0}]
[39,null,null,0,0,0,0,0,0,0,0,0,{"$f":"SUM(D43:L43*(D43:L43>=LARGE(D43:L43,Qui!$A$402)))","v":0},{"$f":"IFERROR((VLOOKUP(CONCATENATE(B43,C43),Qui!$D$301:$F$356,3,)),0)","v":0},39,null,null,0,{"$f":"IFERROR((VLOOKUP(CONCATENATE(P43,Q43),Qui!$D$301:$F$356,3,0)),0)","v":0}]
[40,null,null,0,0,0,0,0,0,0,0,0,{"$f":"SUM(D44:L44*(D44:L44>=LARGE(D44:L44,Qui!$A$402)))","v":0},{"$f":"IFERROR((VLOOKUP(CONCATENATE(B44,C44),Qui!$D$301:$F$356,3,)),0)","v":0},40,null,null,0,{"$f":"IFERROR((VLOOKUP(CONCATENATE(P44,Q44),Qui!$D$301:$F$356,3,0)),0)","v":0}]
[41,null,null,0,0,0,0,0,0,0,0,0,{"$f":"SUM(D45:L45*(D45:L45>=LARGE(D45:L45,Qui!$A$402)))","v":0},{"$f":"IFERROR((VLOOKUP(CONCATENATE(B45,C45),Qui!$D$301:$F$356,3,)),0)","v":0},41,null,null,0,{"$f":"IFERROR((VLOOKUP(CONCATENATE(P45,Q45),Qui!$D$301:$F$356,3,0)),0)","v":0}]
[42,null,null,0,0,0,0,0,0,0,0,0,{"$f":"SUM(D46:L46*(D46:L46>=LARGE(D46:L46,Qui!$A$402)))","v":0},{"$f":"IFERROR((VLOOKUP(CONCATENATE(B46,C46),Qui!$D$301:$F$356,3,)),0)","v":0},42,null,null,0,{"$f":"IFERROR((VLOOKUP(CONCATENATE(P46,Q46),Qui!$D$301:$F$356,3,0)),0)","v":0}]
[43,null,null,0,0,0,0,0,0,0,0,0,{"$f":"SUM(D47:L47*(D47:L47>=LARGE(D47:L47,Qui!$A$402)))","v":0},{"$f":"IFERROR((VLOOKUP(CONCATENATE(B47,C47),Qui!$D$301:$F$356,3,)),0)","v":0},43,null,null,0,{"$f":"IFERROR((VLOOKUP(CONCATENATE(P47,Q47),Qui!$D$301:$F$356,3,0)),0)","v":0}]
[44,null,null,0,0,0,0,0,0,0,0,0,{"$f":"SUM(D48:L48*(D48:L48>=LARGE(D48:L48,Qui!$A$402)))","v":0},{"$f":"IFERROR((VLOOKUP(CONCATENATE(B48,C48),Qui!$D$301:$F$356,3,)),0)","v":0},44,null,null,0,{"$f":"IFERROR((VLOOKUP(CONCATENATE(P48,Q48),Qui!$D$301:$F$356,3,0)),0)","v":0}]
[45,null,null,0,0,0,0,0,0,0,0,0,{"$f":"SUM(D49:L49*(D49:L49>=LARGE(D49:L49,Qui!$A$402)))","v":0},{"$f":"IFERROR((VLOOKUP(CONCATENATE(B49,C49),Qui!$D$301:$F$356,3,)),0)","v":0},45,null,null,0,{"$f":"IFERROR((VLOOKUP(CONCATENATE(P49,Q49),Qui!$D$301:$F$356,3,0)),0)","v":0}]
[46,null,null,0,0,0,0,0,0,0,0,0,{"$f":"SUM(D50:L50*(D50:L50>=LARGE(D50:L50,Qui!$A$402)))","v":0},{"$f":"IFERROR((VLOOKUP(CONCATENATE(B50,C50),Qui!$D$301:$F$356,3,)),0)","v":0},46,null,null,0,{"$f":"IFERROR((VLOOKUP(CONCATENATE(P50,Q50),Qui!$D$301:$F$356,3,0)),0)","v":0}]
[47,null,null,0,0,0,0,0,0,0,0,0,{"$f":"SUM(D51:L51*(D51:L51>=LARGE(D51:L51,Qui!$A$402)))","v":0},{"$f":"IFERROR((VLOOKUP(CONCATENATE(B51,C51),Qui!$D$301:$F$356,3,)),0)","v":0},47,null,null,0,{"$f":"IFERROR((VLOOKUP(CONCATENATE(P51,Q51),Qui!$D$301:$F$356,3,0)),0)","v":0}]
[48,null,null,0,0,0,0,0,0,0,0,0,{"$f":"SUM(D52:L52*(D52:L52>=LARGE(D52:L52,Qui!$A$402)))","v":0},{"$f":"IFERROR((VLOOKUP(CONCATENATE(B52,C52),Qui!$D$301:$F$356,3,)),0)","v":0},48,null,null,0,{"$f":"IFERROR((VLOOKUP(CONCATENATE(P52,Q52),Qui!$D$301:$F$356,3,0)),0)","v":0}]
[49,null,null,0,0,0,0,0,0,0,0,0,{"$f":"SUM(D53:L53*(D53:L53>=LARGE(D53:L53,Qui!$A$402)))","v":0},{"$f":"IFERROR((VLOOKUP(CONCATENATE(B53,C53),Qui!$D$301:$F$356,3,)),0)","v":0},49,null,null,0,{"$f":"IFERROR((VLOOKUP(CONCATENATE(P53,Q53),Qui!$D$301:$F$356,3,0)),0)","v":0}]
[50,null,null,0,0,0,0,0,0,0,0,0,{"$f":"SUM(D54:L54*(D54:L54>=LARGE(D54:L54,Qui!$A$402)))","v":0},{"$f":"IFERROR((VLOOKUP(CONCATENATE(B54,C54),Qui!$D$301:$F$356,3,)),0)","v":0},50,null,null,0,{"$f":"IFERROR((VLOOKUP(CONCATENATE(P54,Q54),Qui!$D$301:$F$356,3,0)),0)","v":0}]
[51,null,null,0,0,0,0,0,0,0,0,0,{"$f":"SUM(D55:L55*(D55:L55>=LARGE(D55:L55,Qui!$A$402)))","v":0},{"$f":"IFERROR((VLOOKUP(CONCATENATE(B55,C55),Qui!$D$301:$F$356,3,)),0)","v":0},51,null,null,0,{"$f":"IFERROR((VLOOKUP(CONCATENATE(P55,Q55),Qui!$D$301:$F$356,3,0)),0)","v":0}]
[52,null,null,0,0,0,0,0,0,0,0,0,{"$f":"SUM(D56:L56*(D56:L56>=LARGE(D56:L56,Qui!$A$402)))","v":0},{"$f":"IFERROR((VLOOKUP(CONCATENATE(B56,C56),Qui!$D$301:$F$356,3,)),0)","v":0},52,null,null,0,{"$f":"IFERROR((VLOOKUP(CONCATENATE(P56,Q56),Qui!$D$301:$F$356,3,0)),0)","v":0}]
[53,null,null,0,0,0,0,0,0,0,0,0,{"$f":"SUM(D57:L57*(D57:L57>=LARGE(D57:L57,Qui!$A$402)))","v":0},{"$f":"IFERROR((VLOOKUP(CONCATENATE(B57,C57),Qui!$D$301:$F$356,3,)),0)","v":0},53,null,null,0,{"$f":"IFERROR((VLOOKUP(CONCATENATE(P57,Q57),Qui!$D$301:$F$356,3,0)),0)","v":0}]
[54,null,null,0,0,0,0,0,0,0,0,0,{"$f":"SUM(D58:L58*(D58:L58>=LARGE(D58:L58,Qui!$A$402)))","v":0},{"$f":"IFERROR((VLOOKUP(CONCATENATE(B58,C58),Qui!$D$301:$F$356,3,)),0)","v":0},54,null,null,0,{"$f":"IFERROR((VLOOKUP(CONCATENATE(P58,Q58),Qui!$D$301:$F$356,3,0)),0)","v":0}]
[{"$nulls":3},{"$f":"MAX(D5:D58)","v":118},null,{"$f":"MAX(F5:F58)","v":0},{"$f":"MAX(G5:G58)","v":0},null,{"$f":"MAX(I5:I58)","v":0},{"$f":"MAX(J5:J58)","v":0},{"$f":"MAX(K5:K58)","v":0},{"$f":"MAX(L5:L58)","v":0}]
["Classement général par équipe",{"$nulls":13},"Classement par équipe"]
[]
[1,"La Vue-des-Alpes",null,480,{"$nulls":8},{"$f":"SUM(D62:L62)","v":480},{"$f":"VLOOKUP(B62,Qui!$A$201:$D$204,4)","v":2},1,"La Vue-des-Alpes",null,0,{"$f":"VLOOKUP(P62,Qui!$A$201:$D$204,4)","v":2}]
[2,"L'Epi",null,{"v":457.59999999999997,"d":"458"},{"$nulls":8},{"$f":"SUM(D63:L63)","v":{"v":457.59999999999997,"d":"458"}},{"$f":"VLOOKUP(B63,Qui!$A$201:$D$204,4)","v":4},2,"L'Epi",null,0,{"$f":"VLOOKUP(P63,Qui!$A$201:$D$204,4)","v":4}]
[3,"La Chaux-de-Fonds",null,442,{"$nulls":8},{"$f":"SUM(D64:L64)","v":442},{"$f":"VLOOKUP(B64,Qui!$A$201:$D$204,4)","v":1},3,"La Chaux-de-Fonds",null,0,{"$f":"VLOOKUP(P64,Qui!$A$201:$D$204,4)","v":1}]
[4,"Le Locle",null,{"v":228.2,"d":"228"},{"$nulls":8},{"$f":"SUM(D65:L65)","v":{"v":228.2,"d":"228"}},{"$f":"VLOOKUP(B65,Qui!$A$201:$D$204,4)","v":3},4,"Le Locle",null,0,{"$f":"VLOOKUP(P65,Qui!$A$201:$D$204,4)","v":3}]
[5,null,null,{"$error":"#N/A"},{"$nulls":10},5,null,null,435,{"$f":"VLOOKUP(P66,Qui!$A$201:$D$204,4)","v":{"$error":"#N/A"}}]
[6,null,null,{"$error":"#N/A"},{"$nulls":10},6,null,null,435,{"$f":"VLOOKUP(P67,Qui!$A$201:$D$204,4)","v":{"$error":"#N/A"}}]
[{"$nulls":3},{"$f":"MAX(D62:D67)","v":{"$error":"#N/A"}},null,{"$f":"MAX(F62:F67)","v":0},{"$f":"MAX(G62:G67)","v":0},null,{"$f":"MAX(I62:I67)","v":0},{"$f":"MAX(J62:J67)","v":0},{"$f":"MAX(K62:K67)","v":0},{"$f":"MAX(L62:L67)","v":0},{"$nulls":5},0]
[{"$nulls":12},"La Chaux-de-Fonds, le 2023 / CM"]
[]
[null,{"$f":"CONCATENATE(\"Rappels :\")","v":"Rappels :"}]
[]
[null,{"$f":"CONCATENATE(\"a) le classement général par équipe  est fait sur le cumul des \",Qui!$B$402,\" meilleurs résultats individuels de chaque manche\")","v":"a) le classement général par équipe  est fait sur le cumul des 5 meilleurs résultats individuels de chaque manche"}]
[null,{"$f":"CONCATENATE(\"b) le classement général individuel est fait sur le cumul des \",Qui!$A$402,\" meilleurs résultats individuels\")","v":"b) le classement général individuel est fait sur le cumul des 5 meilleurs résultats individuels"}]

{"sheet":"Manche_3","index":5,"n_rows":74,"n_cols":21,"rows_kept":74,"hidden":true,"merged":[[0,0,0,17],[1,0,1,17],[2,0,2,1],[2,15,2,17],[3,15,3,17],[60,1,60,2],[60,15,60,16],[67,1,67,2],[68,12,68,17],[70,1,70,17],[71,1,71,17],[72,1,72,17],[73,1,73,17]]}
["Association intercantonale \ndes joueurs de boules\nGrand Jeu Neuchâtelois"]
[{"$f":"CONCATENATE(\"Championnat grand jeu neuchâtelois \",YEAR(Calendrier!B6))","v":"Championnat grand jeu neuchâtelois 2024"}]
["Classement général individuel",null,"Manches",{"$f":"Calendrier!F40","v":"Grand-Sommartel"},{"$f":"Calendrier!F47","v":"Le Locle"},{"$f":"Calendrier!F54","v":"Evologia"},{"$f":"Calendrier!F61","v":"La  Vue-des-Alpes"},{"$f":"Calendrier!F68","v":"L'Epi"},{"$f":"Calendrier!F75","v":"La  Chaux-de-Fonds"},{"$f":"Calendrier!F82","v":"00:00:00"},null,null,{"$f":"CONCATENATE(\"Général\",CHAR(10),\"les \",Qui!$A$402,\" meilleurs\")","v":"Général\nles 5 meilleurs"},null,null,{"$f":"CONCATENATE(\"Classement de la manche\",CHAR(10),Calendrier!F54,CHAR(10),\"du\",TEXT(Calendrier!F56,\" jj.mm\"),\" au\",TEXT(Calendrier!F59,\" jj.mm.aaaa\"))","v":"Classement de la manche\nEvologia\ndu 30.09 au 03.10.2024"},{"$nulls":4},{"$f":"CONCATENATE(TEXT(Calendrier!F56,\" jj.mm\"),\" au\",TEXT(Calendrier!F59,\" jj.mm.aaaa\"))","v":" 30.09 au 03.10.2024"}]
[{"$nulls":3},1,2,3,4,5,6,7,8,9,{"$nulls":3},{"$f":"CONCATENATE(\"Champion de jeu : \",CHAR(10),P5,\" \",Q5)","v":"Champion de jeu : \n "}]
[1,{"$nulls":11},{"$f":"SUM(D5:L5*(D5:L5>=LARGE(D5:L5,Qui!$A$402)))","v":{"$error":"#NUM!"}},{"$f":"IFERROR((VLOOKUP(CONCATENATE(B5,C5),Qui!$D$301:$F$356,3,)),0)","v":0},1,null,null,0,{"$f":"IFERROR((VLOOKUP(CONCATENATE(P5,Q5),Qui!$D$301:$F$356,3,0)),0)","v":0}]
[2,{"$nulls":11},{"$f":"SUM(D6:L6*(D6:L6>=LARGE(D6:L6,Qui!$A$402)))","v":{"$error":"#NUM!"}},{"$f":"IFERROR((VLOOKUP(CONCATENATE(B6,C6),Qui!$D$301:$F$356,3,)),0)","v":0},2,null,null,0,{"$f":"IFERROR((VLOOKUP(CONCATENATE(P6,Q6),Qui!$D$301:$F$356,3,0)),0)","v":0}]
[3,{"$nulls":11},{"$f":"SUM(D7:L7*(D7:L7>=LARGE(D7:L7,Qui!$A$402)))","v":{"$error":"#NUM!"}},{"$f":"IFERROR((VLOOKUP(CONCATENATE(B7,C7),Qui!$D$301:$F$356,3,)),0)","v":0},3,null,null,0,{"$f":"IFERROR((VLOOKUP(CONCATENATE(P7,Q7),Qui!$D$301:$F$356,3,0)),0)","v":0}]
[4,{"$nulls":11},{"$f":"SUM(D8:L8*(D8:L8>=LARGE(D8:L8,Qui!$A$402)))","v":{"$error":"#NUM!"}},{"$f":"IFERROR((VLOOKUP(CONCATENATE(B8,C8),Qui!$D$301:$F$356,3,)),0)","v":0},4,null,null,0,{"$f":"IFERROR((VLOOKUP(CONCATENATE(P8,Q8),Qui!$D$301:$F$356,3,0)),0)","v":0}]
[5,{"$nulls":11},{"$f":"SUM(D9:L9*(D9:L9>=LARGE(D9:L9,Qui!$A$402)))","v":{"$error":"#NUM!"}},{"$f":"IFERROR((VLOOKUP(CONCATENATE(B9,C9),Qui!$D$301:$F$356,3,)),0)","v":0},5,null,null,0,{"$f":"IFERROR((VLOOKUP(CONCATENATE(P9,Q9),Qui!$D$301:$F$356,3,0)),0)","v":0}]
[6,{"$nulls":11},{"$f":"SUM(D10:L10*(D10:L10>=LARGE(D10:L10,Qui!$A$402)))","v":{"$error":"#NUM!"}},{"$f":"IFERROR((VLOOKUP(CONCATENATE(B10,C10),Qui!$D$301:$F$356,3,)),0)","v":0},6,null,null,0,{"$f":"IFERROR((VLOOKUP(CONCATENATE(P10,Q10),Qui!$D$301:$F$356,3,0)),0)","v":0}]
[7,{"$nulls":11},{"$f":"SUM(D11:L11*(D11:L11>=LARGE(D11:L11,Qui!$A$402)))","v":{"$error":"#NUM!"}},{"$f":"IFERROR((VLOOKUP(CONCATENATE(B11,C11),Qui!$D$301:$F$356,3,)),0)","v":0},7,null,null,0,{"$f":"IFERROR((VLOOKUP(CONCATENATE(P11,Q11),Qui!$D$301:$F$356,3,0)),0)","v":0}]
[8,{"$nulls":11},{"$f":"SUM(D12:L12*(D12:L12>=LARGE(D12:L12,Qui!$A$402)))","v":{"$error":"#NUM!"}},{"$f":"IFERROR((VLOOKUP(CONCATENATE(B12,C12),Qui!$D$301:$F$356,3,)),0)","v":0},8,null,null,0,{"$f":"IFERROR((VLOOKUP(CONCATENATE(P12,Q12),Qui!$D$301:$F$356,3,0)),0)","v":0}]
[9,{"$nulls":11},{"$f":"SUM(D13:L13*(D13:L13>=LARGE(D13:L13,Qui!$A$402)))","v":{"$error":"#NUM!"}},{"$f":"IFERROR((VLOOKUP(CONCATENATE(B13,C13),Qui!$D$301:$F$356,3,)),0)","v":0},9,null,null,0,{"$f":"IFERROR((VLOOKUP(CONCATENATE(P13,Q13),Qui!$D$301:$F$356,3,0)),0)","v":0}]
[10,{"$nulls":11},{"$f":"SUM(D14:L14*(D14:L14>=LARGE(D14:L14,Qui!$A$402)))","v":{"$error":"#NUM!"}},{"$f":"IFERROR((VLOOKUP(CONCATENATE(B14,C14),Qui!$D$301:$F$356,3,)),0)","v":0},10,null,null,0,{"$f":"IFERROR((VLOOKUP(CONCATENATE(P14,Q14),Qui!$D$301:$F$356,3,0)),0)","v":0}]
[11,{"$nulls":11},{"$f":"SUM(D15:L15*(D15:L15>=LARGE(D15:L15,Qui!$A$402)))","v":{"$error":"#NUM!"}},{"$f":"IFERROR((VLOOKUP(CONCATENATE(B15,C15),Qui!$D$301:$F$356,3,)),0)","v":0},11,null,null,0,{"$f":"IFERROR((VLOOKUP(CONCATENATE(P15,Q15),Qui!$D$301:$F$356,3,0)),0)","v":0}]
[12,{"$nulls":11},{"$f":"SUM(D16:L16*(D16:L16>=LARGE(D16:L16,Qui!$A$402)))","v":{"$error":"#NUM!"}},{"$f":"IFERROR((VLOOKUP(CONCATENATE(B16,C16),Qui!$D$301:$F$356,3,)),0)","v":0},12,null,null,0,{"$f":"IFERROR((VLOOKUP(CONCATENATE(P16,Q16),Qui!$D$301:$F$356,3,0)),0)","v":0}]
[13,{"$nulls":11},{"$f":"SUM(D17:L17*(D17:L17>=LARGE(D17:L17,Qui!$A$402)))","v":{"$error":"#NUM!"}},{"$f":"IFERROR((VLOOKUP(CONCATENATE(B17,C17),Qui!$D$301:$F$356,3,)),0)","v":0},13,null,null,0,{"$f":"IFERROR((VLOOKUP(CONCATENATE(P17,Q17),Qui!$D$301:$F$356,3,0)),0)","v":0}]
[14,{"$nulls":11},{"$f":"SUM(D18:L18*(D18:L18>=LARGE(D18:L18,Qui!$A$402)))","v":{"$error":"#NUM!"}},{"$f":"IFERROR((VLOOKUP(CONCATENATE(B18,C18),Qui!$D$301:$F$356,3,)),0)","v":0},14,null,null,0,{"$f":"IFERROR((VLOOKUP(CONCATENATE(P18,Q18),Qui!$D$301:$F$356,3,0)),0)","v":0}]
[15,{"$nulls":11},{"$f":"SUM(D19:L19*(D19:L19>=LARGE(D19:L19,Qui!$A$402)))","v":{"$error":"#NUM!"}},{"$f":"IFERROR((VLOOKUP(CONCATENATE(B19,C19),Qui!$D$301:$F$356,3,)),0)","v":0},15,null,null,0,{"$f":"IFERROR((VLOOKUP(CONCATENATE(P19,Q19),Qui!$D$301:$F$356,3,0)),0)","v":0}]
[16,{"$nulls":11},{"$f":"SUM(D20:L20*(D20:L20>=LARGE(D20:L20,Qui!$A$402)))","v":{"$error":"#NUM!"}},{"$f":"IFERROR((VLOOKUP(CONCATENATE(B20,C20),Qui!$D$301:$F$356,3,)),0)","v":0},16,null,null,0,{"$f":"IFERROR((VLOOKUP(CONCATENATE(P20,Q20),Qui!$D$301:$F$356,3,0)),0)","v":0}]
[17,{"$nulls":11},{"$f":"SUM(D21:L21*(D21:L21>=LARGE(D21:L21,Qui!$A$402)))","v":{"$error":"#NUM!"}},{"$f":"IFERROR((VLOOKUP(CONCATENATE(B21,C21),Qui!$D$301:$F$356,3,)),0)","v":0},17,null,null,0,{"$f":"IFERROR((VLOOKUP(CONCATENATE(P21,Q21),Qui!$D$301:$F$356,3,0)),0)","v":0}]
[18,{"$nulls":11},{"$f":"SUM(D22:L22*(D22:L22>=LARGE(D22:L22,Qui!$A$402)))","v":{"$error":"#NUM!"}},{"$f":"IFERROR((VLOOKUP(CONCATENATE(B22,C22),Qui!$D$301:$F$356,3,)),0)","v":0},18,null,null,0,{"$f":"IFERROR((VLOOKUP(CONCATENATE(P22,Q22),Qui!$D$301:$F$356,3,0)),0)","v":0}]
[19,{"$nulls":11},{"$f":"SUM(D23:L23*(D23:L23>=LARGE(D23:L23,Qui!$A$402)))","v":{"$error":"#NUM!"}},{"$f":"IFERROR((VLOOKUP(CONCATENATE(B23,C23),Qui!$D$301:$F$356,3,)),0)","v":0},19,null,null,0,{"$f":"IFERROR((VLOOKUP(CONCATENATE(P23,Q23),Qui!$D$301:$F$356,3,0)),0)","v":0}]
[20,{"$nulls":11},{"$f":"SUM(D24:L24*(D24:L24>=LARGE(D24:L24,Qui!$A$402)))","v":{"$error":"#NUM!"}},{"$f":"IFERROR((VLOOKUP(CONCATENATE(B24,C24),Qui!$D$301:$F$356,3,)),0)","v":0},20,null,null,0,{"$f":"IFERROR((VLOOKUP(CONCATENATE(P24,Q24),Qui!$D$301:$F$356,3,0)),0)","v":0}]
[21,{"$nulls":11},{"$f":"SUM(D25:L25*(D25:L25>=LARGE(D25:L25,Qui!$A$402)))","v":{"$error":"#NUM!"}},{"$f":"IFERROR((VLOOKUP(CONCATENATE(B25,C25),Qui!$D$301:$F$356,3,)),0)","v":0},21,null,null,0,{"$f":"IFERROR((VLOOKUP(CONCATENATE(P25,Q25),Qui!$D$301:$F$356,3,0)),0)","v":0}]
[22,{"$nulls":11},{"$f":"SUM(D26:L26*(D26:L26>=LARGE(D26:L26,Qui!$A$402)))","v":{"$error":"#NUM!"}},{"$f":"IFERROR((VLOOKUP(CONCATENATE(B26,C26),Qui!$D$301:$F$356,3,)),0)","v":0},22,null,null,0,{"$f":"IFERROR((VLOOKUP(CONCATENATE(P26,Q26),Qui!$D$301:$F$356,3,0)),0)","v":0}]
[23,{"$nulls":11},{"$f":"SUM(D27:L27*(D27:L27>=LARGE(D27:L27,Qui!$A$402)))","v":{"$error":"#NUM!"}},{"$f":"IFERROR((VLOOKUP(CONCATENATE(B27,C27),Qui!$D$301:$F$356,3,)),0)","v":0},23,null,null,0,{"$f":"IFERROR((VLOOKUP(CONCATENATE(P27,Q27),Qui!$D$301:$F$356,3,0)),0)","v":0}]
[24,{"$nulls":11},{"$f":"SUM(D28:L28*(D28:L28>=LARGE(D28:L28,Qui!$A$402)))","v":{"$error":"#NUM!"}},{"$f":"IFERROR((VLOOKUP(CONCATENATE(B28,C28),Qui!$D$301:$F$356,3,)),0)","v":0},24,null,null,0,{"$f":"IFERROR((VLOOKUP(CONCATENATE(P28,Q28),Qui!$D$301:$F$356,3,0)),0)","v":0}]
[25,{"$nulls":11},{"$f":"SUM(D29:L29*(D29:L29>=LARGE(D29:L29,Qui!$A$402)))","v":{"$error":"#NUM!"}},{"$f":"IFERROR((VLOOKUP(CONCATENATE(B29,C29),Qui!$D$301:$F$356,3,)),0)","v":0},25,null,null,0,{"$f":"IFERROR((VLOOKUP(CONCATENATE(P29,Q29),Qui!$D$301:$F$356,3,0)),0)","v":0}]
[26,{"$nulls":11},{"$f":"SUM(D30:L30*(D30:L30>=LARGE(D30:L30,Qui!$A$402)))","v":{"$error":"#NUM!"}},{"$f":"IFERROR((VLOOKUP(CONCATENATE(B30,C30),Qui!$D$301:$F$356,3,)),0)","v":0},26,null,null,0,{"$f":"IFERROR((VLOOKUP(CONCATENATE(P30,Q30),Qui!$D$301:$F$356,3,0)),0)","v":0}]
[27,{"$nulls":11},{"$f":"SUM(D31:L31*(D31:L31>=LARGE(D31:L31,Qui!$A$402)))","v":{"$error":"#NUM!"}},{"$f":"IFERROR((VLOOKUP(CONCATENATE(B31,C31),Qui!$D$301:$F$356,3,)),0)","v":0},27,null,null,0,{"$f":"IFERROR((VLOOKUP(CONCATENATE(P31,Q31),Qui!$D$301:$F$356,3,0)),0)","v":0}]
[28,{"$nulls":11},{"$f":"SUM(D32:L32*(D32:L32>=LARGE(D32:L32,Qui!$A$402)))","v":{"$error":"#NUM!"}},{"$f":"IFERROR((VLOOKUP(CONCATENATE(B32,C32),Qui!$D$301:$F$356,3,)),0)","v":0},28,null,null,0,{"$f":"IFERROR((VLOOKUP(CONCATENATE(P32,Q32),Qui!$D$301:$F$356,3,0)),0)","v":0}]
[29,{"$nulls":11},{"$f":"SUM(D33:L33*(D33:L33>=LARGE(D33:L33,Qui!$A$402)))","v":{"$error":"#NUM!"}},{"$f":"IFERROR((VLOOKUP(CONCATENATE(B33,C33),Qui!$D$301:$F$356,3,)),0)","v":0},29,null,null,0,{"$f":"IFERROR((VLOOKUP(CONCATENATE(P33,Q33),Qui!$D$301:$F$356,3,0)),0)","v":0}]
[30,{"$nulls":11},{"$f":"SUM(D34:L34*(D34:L34>=LARGE(D34:L34,Qui!$A$402)))","v":{"$error":"#NUM!"}},{"$f":"IFERROR((VLOOKUP(CONCATENATE(B34,C34),Qui!$D$301:$F$356,3,)),0)","v":0},30,null,null,0,{"$f":"IFERROR((VLOOKUP(CONCATENATE(P34,Q34),Qui!$D$301:$F$356,3,0)),0)","v":0}]
[31,{"$nulls":11},{"$f":"SUM(D35:L35*(D35:L35>=LARGE(D35:L35,Qui!$A$402)))","v":{"$error":"#NUM!"}},{"$f":"IFERROR((VLOOKUP(CONCATENATE(B35,C35),Qui!$D$301:$F$356,3,)),0)","v":0},31,null,null,0,{"$f":"IFERROR((VLOOKUP(CONCATENATE(P35,Q35),Qui!$D$301:$F$356,3,0)),0)","v":0}]
[32,{"$nulls":11},{"$f":"SUM(D36:L36*(D36:L36>=LARGE(D36:L36,Qui!$A$402)))","v":{"$error":"#NUM!"}},{"$f":"IFERROR((VLOOKUP(CONCATENATE(B36,C36),Qui!$D$301:$F$356,3,)),0)","v":0},32,null,null,0,{"$f":"IFERROR((VLOOKUP(CONCATENATE(P36,Q36),Qui!$D$301:$F$356,3,0)),0)","v":0}]
[33,{"$nulls":11},{"$f":"SUM(D37:L37*(D37:L37>=LARGE(D37:L37,Qui!$A$402)))","v":{"$error":"#NUM!"}},{"$f":"IFERROR((VLOOKUP(CONCATENATE(B37,C37),Qui!$D$301:$F$356,3,)),0)","v":0},33,null,null,0,{"$f":"IFERROR((VLOOKUP(CONCATENATE(P37,Q37),Qui!$D$301:$F$356,3,0)),0)","v":0}]
[34,{"$nulls":11},{"$f":"SUM(D38:L38*(D38:L38>=LARGE(D38:L38,Qui!$A$402)))","v":{"$error":"#NUM!"}},{"$f":"IFERROR((VLOOKUP(CONCATENATE(B38,C38),Qui!$D$301:$F$356,3,)),0)","v":0},34,null,null,0,{"$f":"IFERROR((VLOOKUP(CONCATENATE(P38,Q38),Qui!$D$301:$F$356,3,0)),0)","v":0}]
[35,{"$nulls":11},{"$f":"SUM(D39:L39*(D39:L39>=LARGE(D39:L39,Qui!$A$402)))","v":{"$error":"#NUM!"}},{"$f":"IFERROR((VLOOKUP(CONCATENATE(B39,C39),Qui!$D$301:$F$356,3,)),0)","v":0},35,null,null,0,{"$f":"IFERROR((VLOOKUP(CONCATENATE(P39,Q39),Qui!$D$301:$F$356,3,0)),0)","v":0}]
[36,null,null,0,0,0,0,0,0,0,0,0,{"$f":"SUM(D40:L40*(D40:L40>=LARGE(D40:L40,Qui!$A$402)))","v":0},{"$f":"IFERROR((VLOOKUP(CONCATENATE(B40,C40),Qui!$D$301:$F$356,3,)),0)","v":0},36,null,null,0,{"$f":"IFERROR((VLOOKUP(CONCATENATE(P40,Q40),Qui!$D$301:$F$356,3,0)),0)","v":0}]
[37,null,null,0,0,0,0,0,0,0,0,0,{"$f":"SUM(D41:L41*(D41:L41>=LARGE(D41:L41,Qui!$A$402)))","v":0},{"$f":"IFERROR((VLOOKUP(CONCATENATE(B41,C41),Qui!$D$301:$F$356,3,)),0)","v":0},37,null,null,0,{"$f":"IFERROR((VLOOKUP(CONCATENATE(P41,Q41),Qui!$D$301:$F$356,3,0)),0)","v":0}]
[38,null,null,0,0,0,0,0,0,0,0,0,{"$f":"SUM(D42:L42*(D42:L42>=LARGE(D42:L42,Qui!$A$402)))","v":0},{"$f":"IFERROR((VLOOKUP(CONCATENATE(B42,C42),Qui!$D$301:$F$356,3,)),0)","v":0},38,null,null,0,{"$f":"IFERROR((VLOOKUP(CONCATENATE(P42,Q42),Qui!$D$301:$F$356,3,0)),0)","v":0}]
[39,null,null,0,0,0,0,0,0,0,0,0,{"$f":"SUM(D43:L43*(D43:L43>=LARGE(D43:L43,Qui!$A$402)))","v":0},{"$f":"IFERROR((VLOOKUP(CONCATENATE(B43,C43),Qui!$D$301:$F$356,3,)),0)","v":0},39,null,null,0,{"$f":"IFERROR((VLOOKUP(CONCATENATE(P43,Q43),Qui!$D$301:$F$356,3,0)),0)","v":0}]
[40,null,null,0,0,0,0,0,0,0,0,0,{"$f":"SUM(D44:L44*(D44:L44>=LARGE(D44:L44,Qui!$A$402)))","v":0},{"$f":"IFERROR((VLOOKUP(CONCATENATE(B44,C44),Qui!$D$301:$F$356,3,)),0)","v":0},40,null,null,0,{"$f":"IFERROR((VLOOKUP(CONCATENATE(P44,Q44),Qui!$D$301:$F$356,3,0)),0)","v":0}]
[41,null,null,0,0,0,0,0,0,0,0,0,{"$f":"SUM(D45:L45*(D45:L45>=LARGE(D45:L45,Qui!$A$402)))","v":0},{"$f":"IFERROR((VLOOKUP(CONCATENATE(B45,C45),Qui!$D$301:$F$356,3,)),0)","v":0},41,null,null,0,{"$f":"IFERROR((VLOOKUP(CONCATENATE(P45,Q45),Qui!$D$301:$F$356,3,0)),0)","v":0}]
[42,null,null,0,0,0,0,0,0,0,0,0,{"$f":"SUM(D46:L46*(D46:L46>=LARGE(D46:L46,Qui!$A$402)))","v":0},{"$f":"IFERROR((VLOOKUP(CONCATENATE(B46,C46),Qui!$D$301:$F$356,3,)),0)","v":0},42,null,null,0,{"$f":"IFERROR((VLOOKUP(CONCATENATE(P46,Q46),Qui!$D$301:$F$356,3,0)),0)","v":0}]
[43,null,null,0,0,0,0,0,0,0,0,0,{"$f":"SUM(D47:L47*(D47:L47>=LARGE(D47:L47,Qui!$A$402)))","v":0},{"$f":"IFERROR((VLOOKUP(CONCATENATE(B47,C47),Qui!$D$301:$F$356,3,)),0)","v":0},43,null,null,0,{"$f":"IFERROR((VLOOKUP(CONCATENATE(P47,Q47),Qui!$D$301:$F$356,3,0)),0)","v":0}]
[44,null,null,0,0,0,0,0,0,0,0,0,{"$f":"SUM(D48:L48*(D48:L48>=LARGE(D48:L48,Qui!$A$402)))","v":0},{"$f":"IFERROR((VLOOKUP(CONCATENATE(B48,C48),Qui!$D$301:$F$356,3,)),0)","v":0},44,null,null,0,{"$f":"IFERROR((VLOOKUP(CONCATENATE(P48,Q48),Qui!$D$301:$F$356,3,0)),0)","v":0}]
[45,null,null,0,0,0,0,0,0,0,0,0,{"$f":"SUM(D49:L49*(D49:L49>=LARGE(D49:L49,Qui!$A$402)))","v":0},{"$f":"IFERROR((VLOOKUP(CONCATENATE(B49,C49),Qui!$D$301:$F$356,3,)),0)","v":0},45,null,null,0,{"$f":"IFERROR((VLOOKUP(CONCATENATE(P49,Q49),Qui!$D$301:$F$356,3,0)),0)","v":0}]
[46,null,null,0,0,0,0,0,0,0,0,0,{"$f":"SUM(D50:L50*(D50:L50>=LARGE(D50:L50,Qui!$A$402)))","v":0},{"$f":"IFERROR((VLOOKUP(CONCATENATE(B50,C50),Qui!$D$301:$F$356,3,)),0)","v":0},46,null,null,0,{"$f":"IFERROR((VLOOKUP(CONCATENATE(P50,Q50),Qui!$D$301:$F$356,3,0)),0)","v":0}]
[47,null,null,0,0,0,0,0,0,0,0,0,{"$f":"SUM(D51:L51*(D51:L51>=LARGE(D51:L51,Qui!$A$402)))","v":0},{"$f":"IFERROR((VLOOKUP(CONCATENATE(B51,C51),Qui!$D$301:$F$356,3,)),0)","v":0},47,null,null,0,{"$f":"IFERROR((VLOOKUP(CONCATENATE(P51,Q51),Qui!$D$301:$F$356,3,0)),0)","v":0}]
[48,null,null,0,0,0,0,0,0,0,0,0,{"$f":"SUM(D52:L52*(D52:L52>=LARGE(D52:L52,Qui!$A$402)))","v":0},{"$f":"IFERROR((VLOOKUP(CONCATENATE(B52,C52),Qui!$D$301:$F$356,3,)),0)","v":0},48,null,null,0,{"$f":"IFERROR((VLOOKUP(CONCATENATE(P52,Q52),Qui!$D$301:$F$356,3,0)),0)","v":0}]
[49,null,null,0,0,0,0,0,0,0,0,0,{"$f":"SUM(D53:L53*(D53:L53>=LARGE(D53:L53,Qui!$A$402)))","v":0},{"$f":"IFERROR((VLOOKUP(CONCATENATE(B53,C53),Qui!$D$301:$F$356,3,)),0)","v":0},49,null,null,0,{"$f":"IFERROR((VLOOKUP(CONCATENATE(P53,Q53),Qui!$D$301:$F$356,3,0)),0)","v":0}]
[50,null,null,0,0,0,0,0,0,0,0,0,{"$f":"SUM(D54:L54*(D54:L54>=LARGE(D54:L54,Qui!$A$402)))","v":0},{"$f":"IFERROR((VLOOKUP(CONCATENATE(B54,C54),Qui!$D$301:$F$356,3,)),0)","v":0},50,null,null,0,{"$f":"IFERROR((VLOOKUP(CONCATENATE(P54,Q54),Qui!$D$301:$F$356,3,0)),0)","v":0}]
[51,null,null,0,0,0,0,0,0,0,0,0,{"$f":"SUM(D55:L55*(D55:L55>=LARGE(D55:L55,Qui!$A$402)))","v":0},{"$f":"IFERROR((VLOOKUP(CONCATENATE(B55,C55),Qui!$D$301:$F$356,3,)),0)","v":0},51,null,null,0,{"$f":"IFERROR((VLOOKUP(CONCATENATE(P55,Q55),Qui!$D$301:$F$356,3,0)),0)","v":0}]
[52,null,null,0,0,0,0,0,0,0,0,0,{"$f":"SUM(D56:L56*(D56:L56>=LARGE(D56:L56,Qui!$A$402)))","v":0},{"$f":"IFERROR((VLOOKUP(CONCATENATE(B56,C56),Qui!$D$301:$F$356,3,)),0)","v":0},52,null,null,0,{"$f":"IFERROR((VLOOKUP(CONCATENATE(P56,Q56),Qui!$D$301:$F$356,3,0)),0)","v":0}]
[53,{"$nulls":3},0,0,0,0,0,0,0,0,{"$f":"SUM(D57:L57*(D57:L57>=LARGE(D57:L57,Qui!$A$402)))","v":0},{"$f":"IFERROR((VLOOKUP(CONCATENATE(B57,C57),Qui!$D$301:$F$356,3,)),0)","v":0},53,null,null,0,{"$f":"IFERROR((VLOOKUP(CONCATENATE(P57,Q57),Qui!$D$301:$F$356,3,0)),0)","v":0}]
[54,{"$nulls":3},0,0,0,0,0,0,0,0,{"$f":"SUM(D58:L58*(D58:L58>=LARGE(D58:L58,Qui!$A$402)))","v":0},{"$f":"IFERROR((VLOOKUP(CONCATENATE(B58,C58),Qui!$D$301:$F$356,3,)),0)","v":0},54,null,null,0,{"$f":"IFERROR((VLOOKUP(CONCATENATE(P58,Q58),Qui!$D$301:$F$356,3,0)),0)","v":0}]
[{"$nulls":3},{"$f":"MAX(D5:D58)","v":0},null,{"$f":"MAX(F5:F58)","v":0},{"$f":"MAX(G5:G58)","v":0},null,{"$f":"MAX(I5:I58)","v":0},{"$f":"MAX(J5:J58)","v":0},{"$f":"MAX(K5:K58)","v":0},{"$f":"MAX(L5:L58)","v":0}]
["Classement général par équipe",{"$nulls":13},"Classement par équipe"]
[]
[1,{"$nulls":11},{"$f":"SUM(D62:L62)","v":0},{"$f":"VLOOKUP(B62,Qui!$A$201:$D$204,4)","v":{"$error":"#N/A"}},1,null,null,0,{"$f":"VLOOKUP(P62,Qui!$A$201:$D$204,4)","v":{"$error":"#N/A"}}]
[2,{"$nulls":11},0,{"$f":"VLOOKUP(B63,Qui!$A$201:$D$204,4)","v":{"$error":"#N/A"}},2,null,null,0,{"$f":"VLOOKUP(P63,Qui!$A$201:$D$204,4)","v":{"$error":"#N/A"}}]
[3,{"$nulls":11},0,{"$f":"VLOOKUP(B64,Qui!$A$201:$D$204,4)","v":{"$error":"#N/A"}},3,null,null,0,{"$f":"VLOOKUP(P64,Qui!$A$201:$D$204,4)","v":{"$error":"#N/A"}}]
[4,{"$nulls":11},0,{"$f":"VLOOKUP(B65,Qui!$A$201:$D$204,4)","v":{"$error":"#N/A"}},4,null,null,0,{"$f":"VLOOKUP(P65,Qui!$A$201:$D$204,4)","v":{"$error":"#N/A"}}]
[5,{"$nulls":3},435,{"$error":"#N/A"},{"$nulls":6},{"$error":"#N/A"},{"$f":"VLOOKUP(B66,Qui!$A$201:$D$204,4)","v":{"$error":"#N/A"}},5,null,null,{"$f":"SUMPRODUCT(((($S$5:$S$58=S66)*$R$5:$R$58*1))*((($S$5:$S$58=S66)*$R$5:$R$58*1)>=LARGE((($S$5:$S$58=S66)*$R$5:$R$58*1),Qui!$B$402)))","v":{"$error":"#N/A"}},{"$f":"VLOOKUP(P66,Qui!$A$201:$D$204,4)","v":{"$error":"#N/A"}}]
[6,{"$nulls":3},435,{"$error":"#N/A"},{"$nulls":6},{"$error":"#N/A"},{"$f":"VLOOKUP(B67,Qui!$A$201:$D$204,4)","v":{"$error":"#N/A"}},6,null,null,{"$f":"SUMPRODUCT(((($S$5:$S$58=S67)*$R$5:$R$58*1))*((($S$5:$S$58=S67)*$R$5:$R$58*1)>=LARGE((($S$5:$S$58=S67)*$R$5:$R$58*1),Qui!$B$402)))","v":{"$error":"#N/A"}},{"$f":"VLOOKUP(P67,Qui!$A$201:$D$204,4)","v":{"$error":"#N/A"}}]
[{"$nulls":3},{"$f":"MAX(D62:D67)","v":0},null,{"$f":"MAX(F62:F67)","v":{"$error":"#N/A"}},{"$f":"MAX(G62:G67)","v":0},null,{"$f":"MAX(I62:I67)","v":0},{"$f":"MAX(J62:J67)","v":0},{"$f":"MAX(K62:K67)","v":0},{"$f":"MAX(L62:L67)","v":0},{"$nulls":5},0]
[{"$nulls":12},"La Chaux-de-Fonds, le 2023 / CM"]
[]
[null,{"$f":"CONCATENATE(\"Rappels :\")","v":"Rappels :"}]
[]
[null,{"$f":"CONCATENATE(\"a) le classement général par équipe  est fait sur le cumul des \",Qui!$B$402,\" meilleurs résultats individuels de chaque manche\")","v":"a) le classement général par équipe  est fait sur le cumul des 5 meilleurs résultats individuels de chaque manche"}]
[null,{"$f":"CONCATENATE(\"b) le classement général individuel est fait sur le cumul des \",Qui!$A$402,\" meilleurs résultats individuels\")","v":"b) le classement général individuel est fait sur le cumul des 5 meilleurs résultats individuels"}]

{"sheet":"Manche_4","index":6,"n_rows":74,"n_cols":21,"rows_kept":74,"hidden":true,"merged":[[0,0,0,17],[1,0,1,17],[2,0,2,1],[2,15,2,17],[3,15,3,17],[60,1,60,2],[60,15,60,16],[67,1,67,2],[68,12,68,17],[70,1,70,17],[71,1,71,17],[72,1,72,17],[73,1,73,17]]}
["Association intercantonale \ndes joueurs de boules\nGrand Jeu Neuchâtelois"]
[{"$f":"CONCATENATE(\"Championnat grand jeu neuchâtelois \",YEAR(Calendrier!B6))","v":"Championnat grand jeu neuchâtelois 2024"}]
["Classement général individuel",null,"Manches",{"$f":"Calendrier!F40","v":"Grand-Sommartel"},{"$f":"Calendrier!F47","v":"Le Locle"},{"$f":"Calendrier!F54","v":"Evologia"},{"$f":"Calendrier!F61","v":"La  Vue-des-Alpes"},{"$f":"Calendrier!F68","v":"L'Epi"},{"$f":"Calendrier!F75","v":"La  Chaux-de-Fonds"},{"$f":"Calendrier!F82","v":"00:00:00"},null,null,{"$f":"CONCATENATE(\"Général\",CHAR(10),\"les \",Qui!$A$402,\" meilleurs\")","v":"Général\nles 5 meilleurs"},null,null,{"$f":"CONCATENATE(\"Classement de la manche\",CHAR(10),Calendrier!F61,CHAR(10),\"du\",TEXT(Calendrier!F63,\" jj.mm\"),\" au\",TEXT(Calendrier!F66,\" jj.mm.aaaa\"))","v":"Classement de la manche\nLa  Vue-des-Alpes\ndu 28.10 au 31.10.2024"},{"$nulls":4},{"$f":"CONCATENATE(TEXT(Calendrier!F63,\" jj.mm\"),\" au\",TEXT(Calendrier!F66,\" jj.mm.aaaa\"))","v":" 28.10 au 31.10.2024"}]
[{"$nulls":3},1,2,3,4,5,6,7,8,9,{"$nulls":3},{"$f":"CONCATENATE(\"Champion de jeu : \",CHAR(10),P5,\" \",Q5)","v":"Champion de jeu : \n "}]
[1,{"$nulls":11},{"$f":"SUM(D5:L5*(D5:L5>=LARGE(D5:L5,Qui!$A$402)))","v":{"$error":"#NUM!"}},{"$f":"IFERROR((VLOOKUP(CONCATENATE(B5,C5),Qui!$D$301:$F$356,3,)),0)","v":0},1,null,null,0,{"$f":"IFERROR((VLOOKUP(CONCATENATE(P5,Q5),Qui!$D$301:$F$356,3,0)),0)","v":0}]
[2,{"$nulls":11},{"$f":"SUM(D6:L6*(D6:L6>=LARGE(D6:L6,Qui!$A$402)))","v":{"$error":"#NUM!"}},{"$f":"IFERROR((VLOOKUP(CONCATENATE(B6,C6),Qui!$D$301:$F$356,3,)),0)","v":0},2,null,null,0,{"$f":"IFERROR((VLOOKUP(CONCATENATE(P6,Q6),Qui!$D$301:$F$356,3,0)),0)","v":0}]
[3,{"$nulls":11},{"$f":"SUM(D7:L7*(D7:L7>=LARGE(D7:L7,Qui!$A$402)))","v":{"$error":"#NUM!"}},{"$f":"IFERROR((VLOOKUP(CONCATENATE(B7,C7),Qui!$D$301:$F$356,3,)),0)","v":0},3,null,null,0,{"$f":"IFERROR((VLOOKUP(CONCATENATE(P7,Q7),Qui!$D$301:$F$356,3,0)),0)","v":0}]
[4,{"$nulls":11},{"$f":"SUM(D8:L8*(D8:L8>=LARGE(D8:L8,Qui!$A$402)))","v":{"$error":"#NUM!"}},{"$f":"IFERROR((VLOOKUP(CONCATENATE(B8,C8),Qui!$D$301:$F$356,3,)),0)","v":0},4,null,null,0,{"$f":"IFERROR((VLOOKUP(CONCATENATE(P8,Q8),Qui!$D$301:$F$356,3,0)),0)","v":0}]
[5,{"$nulls":11},{"$f":"SUM(D9:L9*(D9:L9>=LARGE(D9:L9,Qui!$A$402)))","v":{"$error":"#NUM!"}},{"$f":"IFERROR((VLOOKUP(CONCATENATE(B9,C9),Qui!$D$301:$F$356,3,)),0)","v":0},5,null,null,0,{"$f":"IFERROR((VLOOKUP(CONCATENATE(P9,Q9),Qui!$D$301:$F$356,3,0)),0)","v":0}]
[6,{"$nulls":11},{"$f":"SUM(D10:L10*(D10:L10>=LARGE(D10:L10,Qui!$A$402)))","v":{"$error":"#NUM!"}},{"$f":"IFERROR((VLOOKUP(CONCATENATE(B10,C10),Qui!$D$301:$F$356,3,)),0)","v":0},6,null,null,0,{"$f":"IFERROR((VLOOKUP(CONCATENATE(P10,Q10),Qui!$D$301:$F$356,3,0)),0)","v":0}]
[7,{"$nulls":11},{"$f":"SUM(D11:L11*(D11:L11>=LARGE(D11:L11,Qui!$A$402)))","v":{"$error":"#NUM!"}},{"$f":"IFERROR((VLOOKUP(CONCATENATE(B11,C11),Qui!$D$301:$F$356,3,)),0)","v":0},7,null,null,0,{"$f":"IFERROR((VLOOKUP(CONCATENATE(P11,Q11),Qui!$D$301:$F$356,3,0)),0)","v":0}]
[8,{"$nulls":11},{"$f":"SUM(D12:L12*(D12:L12>=LARGE(D12:L12,Qui!$A$402)))","v":{"$error":"#NUM!"}},{"$f":"IFERROR((VLOOKUP(CONCATENATE(B12,C12),Qui!$D$301:$F$356,3,)),0)","v":0},8,null,null,0,{"$f":"IFERROR((VLOOKUP(CONCATENATE(P12,Q12),Qui!$D$301:$F$356,3,0)),0)","v":0}]
[9,{"$nulls":11},{"$f":"SUM(D13:L13*(D13:L13>=LARGE(D13:L13,Qui!$A$402)))","v":{"$error":"#NUM!"}},{"$f":"IFERROR((VLOOKUP(CONCATENATE(B13,C13),Qui!$D$301:$F$356,3,)),0)","v":0},9,null,null,0,{"$f":"IFERROR((VLOOKUP(CONCATENATE(P13,Q13),Qui!$D$301:$F$356,3,0)),0)","v":0}]
[10,{"$nulls":11},{"$f":"SUM(D14:L14*(D14:L14>=LARGE(D14:L14,Qui!$A$402)))","v":{"$error":"#NUM!"}},{"$f":"IFERROR((VLOOKUP(CONCATENATE(B14,C14),Qui!$D$301:$F$356,3,)),0)","v":0},10,null,null,0,{"$f":"IFERROR((VLOOKUP(CONCATENATE(P14,Q14),Qui!$D$301:$F$356,3,0)),0)","v":0}]
[11,{"$nulls":11},{"$f":"SUM(D15:L15*(D15:L15>=LARGE(D15:L15,Qui!$A$402)))","v":{"$error":"#NUM!"}},{"$f":"IFERROR((VLOOKUP(CONCATENATE(B15,C15),Qui!$D$301:$F$356,3,)),0)","v":0},11,null,null,0,{"$f":"IFERROR((VLOOKUP(CONCATENATE(P15,Q15),Qui!$D$301:$F$356,3,0)),0)","v":0}]
[12,{"$nulls":11},{"$f":"SUM(D16:L16*(D16:L16>=LARGE(D16:L16,Qui!$A$402)))","v":{"$error":"#NUM!"}},{"$f":"IFERROR((VLOOKUP(CONCATENATE(B16,C16),Qui!$D$301:$F$356,3,)),0)","v":0},12,null,null,0,{"$f":"IFERROR((VLOOKUP(CONCATENATE(P16,Q16),Qui!$D$301:$F$356,3,0)),0)","v":0}]
[13,{"$nulls":11},{"$f":"SUM(D17:L17*(D17:L17>=LARGE(D17:L17,Qui!$A$402)))","v":{"$error":"#NUM!"}},{"$f":"IFERROR((VLOOKUP(CONCATENATE(B17,C17),Qui!$D$301:$F$356,3,)),0)","v":0},13,null,null,0,{"$f":"IFERROR((VLOOKUP(CONCATENATE(P17,Q17),Qui!$D$301:$F$356,3,0)),0)","v":0}]
[14,{"$nulls":11},{"$f":"SUM(D18:L18*(D18:L18>=LARGE(D18:L18,Qui!$A$402)))","v":{"$error":"#NUM!"}},{"$f":"IFERROR((VLOOKUP(CONCATENATE(B18,C18),Qui!$D$301:$F$356,3,)),0)","v":0},14,null,null,0,{"$f":"IFERROR((VLOOKUP(CONCATENATE(P18,Q18),Qui!$D$301:$F$356,3,0)),0)","v":0}]
[15,{"$nulls":11},{"$f":"SUM(D19:L19*(D19:L19>=LARGE(D19:L19,Qui!$A$402)))","v":{"$error":"#NUM!"}},{"$f":"IFERROR((VLOOKUP(CONCATENATE(B19,C19),Qui!$D$301:$F$356,3,)),0)","v":0},15,null,null,0,{"$f":"IFERROR((VLOOKUP(CONCATENATE(P19,Q19),Qui!$D$301:$F$356,3,0)),0)","v":0}]
[16,{"$nulls":11},{"$f":"SUM(D20:L20*(D20:L20>=LARGE(D20:L20,Qui!$A$402)))","v":{"$error":"#NUM!"}},{"$f":"IFERROR((VLOOKUP(CONCATENATE(B20,C20),Qui!$D$301:$F$356,3,)),0)","v":0},16,null,null,0,{"$f":"IFERROR((VLOOKUP(CONCATENATE(P20,Q20),Qui!$D$301:$F$356,3,0)),0)","v":0}]
[17,{"$nulls":11},{"$f":"SUM(D21:L21*(D21:L21>=LARGE(D21:L21,Qui!$A$402)))","v":{"$error":"#NUM!"}},{"$f":"IFERROR((VLOOKUP(CONCATENATE(B21,C21),Qui!$D$301:$F$356,3,)),0)","v":0},17,null,null,0,{"$f":"IFERROR((VLOOKUP(CONCATENATE(P21,Q21),Qui!$D$301:$F$356,3,0)),0)","v":0}]
[18,{"$nulls":11},{"$f":"SUM(D22:L22*(D22:L22>=LARGE(D22:L22,Qui!$A$402)))","v":{"$error":"#NUM!"}},{"$f":"IFERROR((VLOOKUP(CONCATENATE(B22,C22),Qui!$D$301:$F$356,3,)),0)","v":0},18,null,null,0,{"$f":"IFERROR((VLOOKUP(CONCATENATE(P22,Q22),Qui!$D$301:$F$356,3,0)),0)","v":0}]
[19,{"$nulls":11},{"$f":"SUM(D23:L23*(D23:L23>=LARGE(D23:L23,Qui!$A$402)))","v":{"$error":"#NUM!"}},{"$f":"IFERROR((VLOOKUP(CONCATENATE(B23,C23),Qui!$D$301:$F$356,3,)),0)","v":0},19,null,null,0,{"$f":"IFERROR((VLOOKUP(CONCATENATE(P23,Q23),Qui!$D$301:$F$356,3,0)),0)","v":0}]
[20,{"$nulls":11},{"$f":"SUM(D24:L24*(D24:L24>=LARGE(D24:L24,Qui!$A$402)))","v":{"$error":"#NUM!"}},{"$f":"IFERROR((VLOOKUP(CONCATENATE(B24,C24),Qui!$D$301:$F$356,3,)),0)","v":0},20,null,null,0,{"$f":"IFERROR((VLOOKUP(CONCATENATE(P24,Q24),Qui!$D$301:$F$356,3,0)),0)","v":0}]
[21,{"$nulls":11},{"$f":"SUM(D25:L25*(D25:L25>=LARGE(D25:L25,Qui!$A$402)))","v":{"$error":"#NUM!"}},{"$f":"IFERROR((VLOOKUP(CONCATENATE(B25,C25),Qui!$D$301:$F$356,3,)),0)","v":0},21,null,null,0,{"$f":"IFERROR((VLOOKUP(CONCATENATE(P25,Q25),Qui!$D$301:$F$356,3,0)),0)","v":0}]
[22,{"$nulls":11},{"$f":"SUM(D26:L26*(D26:L26>=LARGE(D26:L26,Qui!$A$402)))","v":{"$error":"#NUM!"}},{"$f":"IFERROR((VLOOKUP(CONCATENATE(B26,C26),Qui!$D$301:$F$356,3,)),0)","v":0},22,null,null,0,{"$f":"IFERROR((VLOOKUP(CONCATENATE(P26,Q26),Qui!$D$301:$F$356,3,0)),0)","v":0}]
[23,{"$nulls":11},{"$f":"SUM(D27:L27*(D27:L27>=LARGE(D27:L27,Qui!$A$402)))","v":{"$error":"#NUM!"}},{"$f":"IFERROR((VLOOKUP(CONCATENATE(B27,C27),Qui!$D$301:$F$356,3,)),0)","v":0},23,null,null,0,{"$f":"IFERROR((VLOOKUP(CONCATENATE(P27,Q27),Qui!$D$301:$F$356,3,0)),0)","v":0}]
[24,{"$nulls":11},{"$f":"SUM(D28:L28*(D28:L28>=LARGE(D28:L28,Qui!$A$402)))","v":{"$error":"#NUM!"}},{"$f":"IFERROR((VLOOKUP(CONCATENATE(B28,C28),Qui!$D$301:$F$356,3,)),0)","v":0},24,null,null,0,{"$f":"IFERROR((VLOOKUP(CONCATENATE(P28,Q28),Qui!$D$301:$F$356,3,0)),0)","v":0}]
[25,{"$nulls":11},{"$f":"SUM(D29:L29*(D29:L29>=LARGE(D29:L29,Qui!$A$402)))","v":{"$error":"#NUM!"}},{"$f":"IFERROR((VLOOKUP(CONCATENATE(B29,C29),Qui!$D$301:$F$356,3,)),0)","v":0},25,null,null,0,{"$f":"IFERROR((VLOOKUP(CONCATENATE(P29,Q29),Qui!$D$301:$F$356,3,0)),0)","v":0}]
[26,{"$nulls":11},{"$f":"SUM(D30:L30*(D30:L30>=LARGE(D30:L30,Qui!$A$402)))","v":{"$error":"#NUM!"}},{"$f":"IFERROR((VLOOKUP(CONCATENATE(B30,C30),Qui!$D$301:$F$356,3,)),0)","v":0},26,null,null,0,{"$f":"IFERROR((VLOOKUP(CONCATENATE(P30,Q30),Qui!$D$301:$F$356,3,0)),0)","v":0}]
[27,{"$nulls":11},{"$f":"SUM(D31:L31*(D31:L31>=LARGE(D31:L31,Qui!$A$402)))","v":{"$error":"#NUM!"}},{"$f":"IFERROR((VLOOKUP(CONCATENATE(B31,C31),Qui!$D$301:$F$356,3,)),0)","v":0},27,null,null,0,{"$f":"IFERROR((VLOOKUP(CONCATENATE(P31,Q31),Qui!$D$301:$F$356,3,0)),0)","v":0}]
[28,{"$nulls":11},{"$f":"SUM(D32:L32*(D32:L32>=LARGE(D32:L32,Qui!$A$402)))","v":{"$error":"#NUM!"}},{"$f":"IFERROR((VLOOKUP(CONCATENATE(B32,C32),Qui!$D$301:$F$356,3,)),0)","v":0},28,null,null,0,{"$f":"IFERROR((VLOOKUP(CONCATENATE(P32,Q32),Qui!$D$301:$F$356,3,0)),0)","v":0}]
[29,{"$nulls":11},{"$f":"SUM(D33:L33*(D33:L33>=LARGE(D33:L33,Qui!$A$402)))","v":{"$error":"#NUM!"}},{"$f":"IFERROR((VLOOKUP(CONCATENATE(B33,C33),Qui!$D$301:$F$356,3,)),0)","v":0},29,null,null,0,{"$f":"IFERROR((VLOOKUP(CONCATENATE(P33,Q33),Qui!$D$301:$F$356,3,0)),0)","v":0}]
[30,{"$nulls":11},{"$f":"SUM(D34:L34*(D34:L34>=LARGE(D34:L34,Qui!$A$402)))","v":{"$error":"#NUM!"}},{"$f":"IFERROR((VLOOKUP(CONCATENATE(B34,C34),Qui!$D$301:$F$356,3,)),0)","v":0},30,null,null,0,{"$f":"IFERROR((VLOOKUP(CONCATENATE(P34,Q34),Qui!$D$301:$F$356,3,0)),0)","v":0}]
[31,{"$nulls":11},{"$f":"SUM(D35:L35*(D35:L35>=LARGE(D35:L35,Qui!$A$402)))","v":{"$error":"#NUM!"}},{"$f":"IFERROR((VLOOKUP(CONCATENATE(B35,C35),Qui!$D$301:$F$356,3,)),0)","v":0},31,null,null,0,{"$f":"IFERROR((VLOOKUP(CONCATENATE(P35,Q35),Qui!$D$301:$F$356,3,0)),0)","v":0}]
[32,{"$nulls":11},{"$f":"SUM(D36:L36*(D36:L36>=LARGE(D36:L36,Qui!$A$402)))","v":{"$error":"#NUM!"}},{"$f":"IFERROR((VLOOKUP(CONCATENATE(B36,C36),Qui!$D$301:$F$356,3,)),0)","v":0},32,null,null,0,{"$f":"IFERROR((VLOOKUP(CONCATENATE(P36,Q36),Qui!$D$301:$F$356,3,0)),0)","v":0}]
[33,{"$nulls":11},{"$f":"SUM(D37:L37*(D37:L37>=LARGE(D37:L37,Qui!$A$402)))","v":{"$error":"#NUM!"}},{"$f":"IFERROR((VLOOKUP(CONCATENATE(B37,C37),Qui!$D$301:$F$356,3,)),0)","v":0},33,null,null,0,{"$f":"IFERROR((VLOOKUP(CONCATENATE(P37,Q37),Qui!$D$301:$F$356,3,0)),0)","v":0}]
[34,{"$nulls":11},{"$f":"SUM(D38:L38*(D38:L38>=LARGE(D38:L38,Qui!$A$402)))","v":{"$error":"#NUM!"}},{"$f":"IFERROR((VLOOKUP(CONCATENATE(B38,C38),Qui!$D$301:$F$356,3,)),0)","v":0},34,null,null,0,{"$f":"IFERROR((VLOOKUP(CONCATENATE(P38,Q38),Qui!$D$301:$F$356,3,0)),0)","v":0}]
[35,{"$nulls":11},{"$f":"SUM(D39:L39*(D39:L39>=LARGE(D39:L39,Qui!$A$402)))","v":{"$error":"#NUM!"}},{"$f":"IFERROR((VLOOKUP(CONCATENATE(B39,C39),Qui!$D$301:$F$356,3,)),0)","v":0},35,null,null,0,{"$f":"IFERROR((VLOOKUP(CONCATENATE(P39,Q39),Qui!$D$301:$F$356,3,0)),0)","v":0}]
[36,null,null,0,0,0,0,0,0,0,0,0,{"$f":"SUM(D40:L40*(D40:L40>=LARGE(D40:L40,Qui!$A$402)))","v":0},{"$f":"IFERROR((VLOOKUP(CONCATENATE(B40,C40),Qui!$D$301:$F$356,3,)),0)","v":0},36,null,null,0,{"$f":"IFERROR((VLOOKUP(CONCATENATE(P40,Q40),Qui!$D$301:$F$356,3,0)),0)","v":0}]
[37,null,null,0,0,0,0,0,0,0,0,0,{"$f":"SUM(D41:L41*(D41:L41>=LARGE(D41:L41,Qui!$A$402)))","v":0},{"$f":"IFERROR((VLOOKUP(CONCATENATE(B41,C41),Qui!$D$301:$F$356,3,)),0)","v":0},37,null,null,0,{"$f":"IFERROR((VLOOKUP(CONCATENATE(P41,Q41),Qui!$D$301:$F$356,3,0)),0)","v":0}]
[38,null,null,0,0,0,0,0,0,0,0,0,{"$f":"SUM(D42:L42*(D42:L42>=LARGE(D42:L42,Qui!$A$402)))","v":0},{"$f":"IFERROR((VLOOKUP(CONCATENATE(B42,C42),Qui!$D$301:$F$356,3,)),0)","v":0},38,null,null,0,{"$f":"IFERROR((VLOOKUP(CONCATENATE(P42,Q42),Qui!$D$301:$F$356,3,0)),0)","v":0}]
[39,null,null,0,0,0,0,0,0,0,0,0,{"$f":"SUM(D43:L43*(D43:L43>=LARGE(D43:L43,Qui!$A$402)))","v":0},{"$f":"IFERROR((VLOOKUP(CONCATENATE(B43,C43),Qui!$D$301:$F$356,3,)),0)","v":0},39,null,null,0,{"$f":"IFERROR((VLOOKUP(CONCATENATE(P43,Q43),Qui!$D$301:$F$356,3,0)),0)","v":0}]
[40,null,null,0,0,0,0,0,0,0,0,0,{"$f":"SUM(D44:L44*(D44:L44>=LARGE(D44:L44,Qui!$A$402)))","v":0},{"$f":"IFERROR((VLOOKUP(CONCATENATE(B44,C44),Qui!$D$301:$F$356,3,)),0)","v":0},40,null,null,0,{"$f":"IFERROR((VLOOKUP(CONCATENATE(P44,Q44),Qui!$D$301:$F$356,3,0)),0)","v":0}]
[41,null,null,0,0,0,0,0,0,0,0,0,{"$f":"SUM(D45:L45*(D45:L45>=LARGE(D45:L45,Qui!$A$402)))","v":0},{"$f":"IFERROR((VLOOKUP(CONCATENATE(B45,C45),Qui!$D$301:$F$356,3,)),0)","v":0},41,null,null,0,{"$f":"IFERROR((VLOOKUP(CONCATENATE(P45,Q45),Qui!$D$301:$F$356,3,0)),0)","v":0}]
[42,null,null,0,0,0,0,0,0,0,0,0,{"$f":"SUM(D46:L46*(D46:L46>=LARGE(D46:L46,Qui!$A$402)))","v":0},{"$f":"IFERROR((VLOOKUP(CONCATENATE(B46,C46),Qui!$D$301:$F$356,3,)),0)","v":0},42,null,null,0,{"$f":"IFERROR((VLOOKUP(CONCATENATE(P46,Q46),Qui!$D$301:$F$356,3,0)),0)","v":0}]
[43,null,null,0,0,0,0,0,0,0,0,0,{"$f":"SUM(D47:L47*(D47:L47>=LARGE(D47:L47,Qui!$A$402)))","v":0},{"$f":"IFERROR((VLOOKUP(CONCATENATE(B47,C47),Qui!$D$301:$F$356,3,)),0)","v":0},43,null,null,0,{"$f":"IFERROR((VLOOKUP(CONCATENATE(P47,Q47),Qui!$D$301:$F$356,3,0)),0)","v":0}]
[44,null,null,0,0,0,0,0,0,0,0,0,{"$f":"SUM(D48:L48*(D48:L48>=LARGE(D48:L48,Qui!$A$402)))","v":0},{"$f":"IFERROR((VLOOKUP(CONCATENATE(B48,C48),Qui!$D$301:$F$356,3,)),0)","v":0},44,null,null,0,{"$f":"IFERROR((VLOOKUP(CONCATENATE(P48,Q48),Qui!$D$301:$F$356,3,0)),0)","v":0}]
[45,null,null,0,0,0,0,0,0,0,0,0,{"$f":"SUM(D49:L49*(D49:L49>=LARGE(D49:L49,Qui!$A$402)))","v":0},{"$f":"IFERROR((VLOOKUP(CONCATENATE(B49,C49),Qui!$D$301:$F$356,3,)),0)","v":0},45,null,null,0,{"$f":"IFERROR((VLOOKUP(CONCATENATE(P49,Q49),Qui!$D$301:$F$356,3,0)),0)","v":0}]
[46,null,null,0,0,0,0,0,0,0,0,0,{"$f":"SUM(D50:L50*(D50:L50>=LARGE(D50:L50,Qui!$A$402)))","v":0},{"$f":"IFERROR((VLOOKUP(CONCATENATE(B50,C50),Qui!$D$301:$F$356,3,)),0)","v":0},46,null,null,0,{"$f":"IFERROR((VLOOKUP(CONCATENATE(P50,Q50),Qui!$D$301:$F$356,3,0)),0)","v":0}]
[47,null,null,0,0,0,0,0,0,0,0,0,{"$f":"SUM(D51:L51*(D51:L51>=LARGE(D51:L51,Qui!$A$402)))","v":0},{"$f":"IFERROR((VLOOKUP(CONCATENATE(B51,C51),Qui!$D$301:$F$356,3,)),0)","v":0},47,null,null,0,{"$f":"IFERROR((VLOOKUP(CONCATENATE(P51,Q51),Qui!$D$301:$F$356,3,0)),0)","v":0}]
[48,null,null,0,0,0,0,0,0,0,0,0,{"$f":"SUM(D52:L52*(D52:L52>=LARGE(D52:L52,Qui!$A$402)))","v":0},{"$f":"IFERROR((VLOOKUP(CONCATENATE(B52,C52),Qui!$D$301:$F$356,3,)),0)","v":0},48,null,null,0,{"$f":"IFERROR((VLOOKUP(CONCATENATE(P52,Q52),Qui!$D$301:$F$356,3,0)),0)","v":0}]
[49,null,null,0,0,0,0,0,0,0,0,0,{"$f":"SUM(D53:L53*(D53:L53>=LARGE(D53:L53,Qui!$A$402)))","v":0},{"$f":"IFERROR((VLOOKUP(CONCATENATE(B53,C53),Qui!$D$301:$F$356,3,)),0)","v":0},49,null,null,0,{"$f":"IFERROR((VLOOKUP(CONCATENATE(P53,Q53),Qui!$D$301:$F$356,3,0)),0)","v":0}]
[50,null,null,0,0,0,0,0,0,0,0,0,{"$f":"SUM(D54:L54*(D54:L54>=LARGE(D54:L54,Qui!$A$402)))","v":0},{"$f":"IFERROR((VLOOKUP(CONCATENATE(B54,C54),Qui!$D$301:$F$356,3,)),0)","v":0},50,null,null,0,{"$f":"IFERROR((VLOOKUP(CONCATENATE(P54,Q54),Qui!$D$301:$F$356,3,0)),0)","v":0}]
[51,null,null,0,0,0,0,0,0,0,0,0,{"$f":"SUM(D55:L55*(D55:L55>=LARGE(D55:L55,Qui!$A$402)))","v":0},{"$f":"IFERROR((VLOOKUP(CONCATENATE(B55,C55),Qui!$D$301:$F$356,3,)),0)","v":0},51,null,null,0,{"$f":"IFERROR((VLOOKUP(CONCATENATE(P55,Q55),Qui!$D$301:$F$356,3,0)),0)","v":0}]
[52,null,null,0,0,0,0,0,0,0,0,0,{"$f":"SUM(D56:L56*(D56:L56>=LARGE(D56:L56,Qui!$A$402)))","v":0},{"$f":"IFERROR((VLOOKUP(CONCATENATE(B56,C56),Qui!$D$301:$F$356,3,)),0)","v":0},52,null,null,0,{"$f":"IFERROR((VLOOKUP(CONCATENATE(P56,Q56),Qui!$D$301:$F$356,3,0)),0)","v":0}]
[53,{"$nulls":3},0,0,0,0,0,0,0,0,{"$f":"SUM(D57:L57*(D57:L57>=LARGE(D57:L57,Qui!$A$402)))","v":0},{"$f":"IFERROR((VLOOKUP(CONCATENATE(B57,C57),Qui!$D$301:$F$356,3,)),0)","v":0},53,null,null,0,{"$f":"IFERROR((VLOOKUP(CONCATENATE(P57,Q57),Qui!$D$301:$F$356,3,0)),0)","v":0}]
[54,{"$nulls":3},0,0,0,0,0,0,0,0,{"$f":"SUM(D58:L58*(D58:L58>=LARGE(D58:L58,Qui!$A$402)))","v":0},{"$f":"IFERROR((VLOOKUP(CONCATENATE(B58,C58),Qui!$D$301:$F$356,3,)),0)","v":0},54,null,null,0,{"$f":"IFERROR((VLOOKUP(CONCATENATE(P58,Q58),Qui!$D$301:$F$356,3,0)),0)","v":0}]
[{"$nulls":3},{"$f":"MAX(D5:D58)","v":0},null,{"$f":"MAX(F5:F58)","v":0},{"$f":"MAX(G5:G58)","v":0},null,{"$f":"MAX(I5:I58)","v":0},{"$f":"MAX(J5:J58)","v":0},{"$f":"MAX(K5:K58)","v":0},{"$f":"MAX(L5:L58)","v":0}]
["Classement général par équipe",{"$nulls":13},"Classement par équipe"]
[]
[1,{"$nulls":11},{"$f":"SUM(D62:L62)","v":0},{"$f":"VLOOKUP(B62,Qui!$A$201:$D$204,4)","v":{"$error":"#N/A"}},1,null,null,0,{"$f":"VLOOKUP(P62,Qui!$A$201:$D$204,4)","v":{"$error":"#N/A"}}]
[2,{"$nulls":11},0,{"$f":"VLOOKUP(B63,Qui!$A$201:$D$204,4)","v":{"$error":"#N/A"}},2,null,null,0,{"$f":"VLOOKUP(P63,Qui!$A$201:$D$204,4)","v":{"$error":"#N/A"}}]
[3,{"$nulls":11},0,{"$f":"VLOOKUP(B64,Qui!$A$201:$D$204,4)","v":{"$error":"#N/A"}},3,null,null,0,{"$f":"VLOOKUP(P64,Qui!$A$201:$D$204,4)","v":{"$error":"#N/A"}}]
[4,{"$nulls":11},0,{"$f":"VLOOKUP(B65,Qui!$A$201:$D$204,4)","v":{"$error":"#N/A"}},4,null,null,0,{"$f":"VLOOKUP(P65,Qui!$A$201:$D$204,4)","v":{"$error":"#N/A"}}]
[5,{"$nulls":3},435,{"$error":"#N/A"},{"$error":"#N/A"},{"$nulls":5},{"$error":"#N/A"},{"$f":"VLOOKUP(B66,Qui!$A$201:$D$204,4)","v":{"$error":"#N/A"}},5,null,null,{"$f":"SUMPRODUCT(((($S$5:$S$58=S66)*$R$5:$R$58*1))*((($S$5:$S$58=S66)*$R$5:$R$58*1)>=LARGE((($S$5:$S$58=S66)*$R$5:$R$58*1),Qui!$B$402)))","v":{"$error":"#N/A"}},{"$f":"VLOOKUP(P66,Qui!$A$201:$D$204,4)","v":{"$error":"#N/A"}}]
[6,{"$nulls":3},435,{"$error":"#N/A"},{"$error":"#N/A"},{"$nulls":5},{"$error":"#N/A"},{"$f":"VLOOKUP(B67,Qui!$A$201:$D$204,4)","v":{"$error":"#N/A"}},6,null,null,{"$f":"SUMPRODUCT(((($S$5:$S$58=S67)*$R$5:$R$58*1))*((($S$5:$S$58=S67)*$R$5:$R$58*1)>=LARGE((($S$5:$S$58=S67)*$R$5:$R$58*1),Qui!$B$402)))","v":{"$error":"#N/A"}},{"$f":"VLOOKUP(P67,Qui!$A$201:$D$204,4)","v":{"$error":"#N/A"}}]
[{"$nulls":3},{"$f":"MAX(D62:D67)","v":0},null,{"$f":"MAX(F62:F67)","v":{"$error":"#N/A"}},{"$f":"MAX(G62:G67)","v":{"$error":"#N/A"}},null,{"$f":"MAX(I62:I67)","v":0},{"$f":"MAX(J62:J67)","v":0},{"$f":"MAX(K62:K67)","v":0},{"$f":"MAX(L62:L67)","v":0},{"$nulls":5},0]
[{"$nulls":12},"La Chaux-de-Fonds, le 2023 / CM"]
[]
[null,{"$f":"CONCATENATE(\"Rappels :\")","v":"Rappels :"}]
[]
[null,{"$f":"CONCATENATE(\"a) le classement général par équipe  est fait sur le cumul des \",Qui!$B$402,\" meilleurs résultats individuels de chaque manche\")","v":"a) le classement général par équipe  est fait sur le cumul des 5 meilleurs résultats individuels de chaque manche"}]
[null,{"$f":"CONCATENATE(\"b) le classement général individuel est fait sur le cumul des \",Qui!$A$402,\" meilleurs résultats individuels\")","v":"b) le classement général individuel est fait sur le cumul des 5 meilleurs résultats individuels"}]

{"sheet":"Manche_5","index":7,"n_rows":74,"n_cols":21,"rows_kept":74,"hidden":true,"merged":[[0,0,0,17],[1,0,1,17],[2,0,2,1],[2,15,2,17],[3,15,3,17],[60,1,60,2],[60,15,60,16],[67,1,67,2],[68,12,68,17],[70,1,70,17],[71,1,71,17],[72,1,72,17],[73,1,73,17]]}
["Association intercantonale \ndes joueurs de boules\nGrand Jeu Neuchâtelois"]
[{"$f":"CONCATENATE(\"Championnat grand jeu neuchâtelois \",YEAR(Calendrier!B6))","v":"Championnat grand jeu neuchâtelois 2024"}]
["Classement général individuel",null,"Manches",{"$f":"Calendrier!F40","v":"Grand-Sommartel"},{"$f":"Calendrier!F47","v":"Le Locle"},{"$f":"Calendrier!F54","v":"Evologia"},{"$f":"Calendrier!F61","v":"La  Vue-des-Alpes"},{"$f":"Calendrier!F68","v":"L'Epi"},{"$f":"Calendrier!F75","v":"La  Chaux-de-Fonds"},{"$f":"Calendrier!F82","v":"00:00:00"},null,null,{"$f":"CONCATENATE(\"Général\",CHAR(10),\"les \",Qui!$A$402,\" meilleurs\")","v":"Général\nles 5 meilleurs"},null,null,{"$f":"CONCATENATE(\"Classement de la manche\",CHAR(10),Calendrier!F68,CHAR(10),\"du\",TEXT(Calendrier!F70,\" jj.mm\"),\" au\",TEXT(Calendrier!F73,\" jj.mm.aaaa\"))","v":"Classement de la manche\nL'Epi\ndu 11.11 au 14.11.2024"},{"$nulls":4},{"$f":"CONCATENATE(TEXT(Calendrier!F70,\" jj.mm\"),\" au\",TEXT(Calendrier!F73,\" jj.mm.aaaa\"))","v":" 11.11 au 14.11.2024"}]
[{"$nulls":3},1,2,3,4,5,6,7,8,9,{"$nulls":3},{"$f":"CONCATENATE(\"Champion de jeu : \",CHAR(10),P5,\" \",Q5)","v":"Champion de jeu : \n "}]
[1,{"$nulls":11},{"$f":"SUM(D5:L5*(D5:L5>=LARGE(D5:L5,Qui!$A$402)))","v":{"$error":"#NUM!"}},{"$f":"IFERROR((VLOOKUP(CONCATENATE(B5,C5),Qui!$D$301:$F$356,3,)),0)","v":0},1,null,null,0,{"$f":"IFERROR((VLOOKUP(CONCATENATE(P5,Q5),Qui!$D$301:$F$356,3,0)),0)","v":0}]
[2,{"$nulls":11},{"$f":"SUM(D6:L6*(D6:L6>=LARGE(D6:L6,Qui!$A$402)))","v":{"$error":"#NUM!"}},{"$f":"IFERROR((VLOOKUP(CONCATENATE(B6,C6),Qui!$D$301:$F$356,3,)),0)","v":0},2,null,null,0,{"$f":"IFERROR((VLOOKUP(CONCATENATE(P6,Q6),Qui!$D$301:$F$356,3,0)),0)","v":0}]
[3,{"$nulls":11},{"$f":"SUM(D7:L7*(D7:L7>=LARGE(D7:L7,Qui!$A$402)))","v":{"$error":"#NUM!"}},{"$f":"IFERROR((VLOOKUP(CONCATENATE(B7,C7),Qui!$D$301:$F$356,3,)),0)","v":0},3,null,null,0,{"$f":"IFERROR((VLOOKUP(CONCATENATE(P7,Q7),Qui!$D$301:$F$356,3,0)),0)","v":0}]
[4,{"$nulls":11},{"$f":"SUM(D8:L8*(D8:L8>=LARGE(D8:L8,Qui!$A$402)))","v":{"$error":"#NUM!"}},{"$f":"IFERROR((VLOOKUP(CONCATENATE(B8,C8),Qui!$D$301:$F$356,3,)),0)","v":0},4,null,null,0,{"$f":"IFERROR((VLOOKUP(CONCATENATE(P8,Q8),Qui!$D$301:$F$356,3,0)),0)","v":0}]
[5,{"$nulls":11},{"$f":"SUM(D9:L9*(D9:L9>=LARGE(D9:L9,Qui!$A$402)))","v":{"$error":"#NUM!"}},{"$f":"IFERROR((VLOOKUP(CONCATENATE(B9,C9),Qui!$D$301:$F$356,3,)),0)","v":0},5,null,null,0,{"$f":"IFERROR((VLOOKUP(CONCATENATE(P9,Q9),Qui!$D$301:$F$356,3,0)),0)","v":0}]
[6,{"$nulls":11},{"$f":"SUM(D10:L10*(D10:L10>=LARGE(D10:L10,Qui!$A$402)))","v":{"$error":"#NUM!"}},{"$f":"IFERROR((VLOOKUP(CONCATENATE(B10,C10),Qui!$D$301:$F$356,3,)),0)","v":0},6,null,null,0,{"$f":"IFERROR((VLOOKUP(CONCATENATE(P10,Q10),Qui!$D$301:$F$356,3,0)),0)","v":0}]
[7,{"$nulls":11},{"$f":"SUM(D11:L11*(D11:L11>=LARGE(D11:L11,Qui!$A$402)))","v":{"$error":"#NUM!"}},{"$f":"IFERROR((VLOOKUP(CONCATENATE(B11,C11),Qui!$D$301:$F$356,3,)),0)","v":0},7,null,null,0,{"$f":"IFERROR((VLOOKUP(CONCATENATE(P11,Q11),Qui!$D$301:$F$356,3,0)),0)","v":0}]
[8,{"$nulls":11},{"$f":"SUM(D12:L12*(D12:L12>=LARGE(D12:L12,Qui!$A$402)))","v":{"$error":"#NUM!"}},{"$f":"IFERROR((VLOOKUP(CONCATENATE(B12,C12),Qui!$D$301:$F$356,3,)),0)","v":0},8,null,null,0,{"$f":"IFERROR((VLOOKUP(CONCATENATE(P12,Q12),Qui!$D$301:$F$356,3,0)),0)","v":0}]
[9,{"$nulls":11},{"$f":"SUM(D13:L13*(D13:L13>=LARGE(D13:L13,Qui!$A$402)))","v":{"$error":"#NUM!"}},{"$f":"IFERROR((VLOOKUP(CONCATENATE(B13,C13),Qui!$D$301:$F$356,3,)),0)","v":0},9,null,null,0,{"$f":"IFERROR((VLOOKUP(CONCATENATE(P13,Q13),Qui!$D$301:$F$356,3,0)),0)","v":0}]
[10,{"$nulls":11},{"$f":"SUM(D14:L14*(D14:L14>=LARGE(D14:L14,Qui!$A$402)))","v":{"$error":"#NUM!"}},{"$f":"IFERROR((VLOOKUP(CONCATENATE(B14,C14),Qui!$D$301:$F$356,3,)),0)","v":0},10,null,null,0,{"$f":"IFERROR((VLOOKUP(CONCATENATE(P14,Q14),Qui!$D$301:$F$356,3,0)),0)","v":0}]
[11,{"$nulls":11},{"$f":"SUM(D15:L15*(D15:L15>=LARGE(D15:L15,Qui!$A$402)))","v":{"$error":"#NUM!"}},{"$f":"IFERROR((VLOOKUP(CONCATENATE(B15,C15),Qui!$D$301:$F$356,3,)),0)","v":0},11,null,null,0,{"$f":"IFERROR((VLOOKUP(CONCATENATE(P15,Q15),Qui!$D$301:$F$356,3,0)),0)","v":0}]
[12,{"$nulls":11},{"$f":"SUM(D16:L16*(D16:L16>=LARGE(D16:L16,Qui!$A$402)))","v":{"$error":"#NUM!"}},{"$f":"IFERROR((VLOOKUP(CONCATENATE(B16,C16),Qui!$D$301:$F$356,3,)),0)","v":0},12,null,null,0,{"$f":"IFERROR((VLOOKUP(CONCATENATE(P16,Q16),Qui!$D$301:$F$356,3,0)),0)","v":0}]
[13,{"$nulls":11},{"$f":"SUM(D17:L17*(D17:L17>=LARGE(D17:L17,Qui!$A$402)))","v":{"$error":"#NUM!"}},{"$f":"IFERROR((VLOOKUP(CONCATENATE(B17,C17),Qui!$D$301:$F$356,3,)),0)","v":0},13,null,null,0,{"$f":"IFERROR((VLOOKUP(CONCATENATE(P17,Q17),Qui!$D$301:$F$356,3,0)),0)","v":0}]
[14,{"$nulls":11},{"$f":"SUM(D18:L18*(D18:L18>=LARGE(D18:L18,Qui!$A$402)))","v":{"$error":"#NUM!"}},{"$f":"IFERROR((VLOOKUP(CONCATENATE(B18,C18),Qui!$D$301:$F$356,3,)),0)","v":0},14,null,null,0,{"$f":"IFERROR((VLOOKUP(CONCATENATE(P18,Q18),Qui!$D$301:$F$356,3,0)),0)","v":0}]
[15,{"$nulls":11},{"$f":"SUM(D19:L19*(D19:L19>=LARGE(D19:L19,Qui!$A$402)))","v":{"$error":"#NUM!"}},{"$f":"IFERROR((VLOOKUP(CONCATENATE(B19,C19),Qui!$D$301:$F$356,3,)),0)","v":0},15,null,null,0,{"$f":"IFERROR((VLOOKUP(CONCATENATE(P19,Q19),Qui!$D$301:$F$356,3,0)),0)","v":0}]
[16,{"$nulls":11},{"$f":"SUM(D20:L20*(D20:L20>=LARGE(D20:L20,Qui!$A$402)))","v":{"$error":"#NUM!"}},{"$f":"IFERROR((VLOOKUP(CONCATENATE(B20,C20),Qui!$D$301:$F$356,3,)),0)","v":0},16,null,null,0,{"$f":"IFERROR((VLOOKUP(CONCATENATE(P20,Q20),Qui!$D$301:$F$356,3,0)),0)","v":0}]
[17,{"$nulls":11},{"$f":"SUM(D21:L21*(D21:L21>=LARGE(D21:L21,Qui!$A$402)))","v":{"$error":"#NUM!"}},{"$f":"IFERROR((VLOOKUP(CONCATENATE(B21,C21),Qui!$D$301:$F$356,3,)),0)","v":0},17,null,null,0,{"$f":"IFERROR((VLOOKUP(CONCATENATE(P21,Q21),Qui!$D$301:$F$356,3,0)),0)","v":0}]
[18,{"$nulls":11},{"$f":"SUM(D22:L22*(D22:L22>=LARGE(D22:L22,Qui!$A$402)))","v":{"$error":"#NUM!"}},{"$f":"IFERROR((VLOOKUP(CONCATENATE(B22,C22),Qui!$D$301:$F$356,3,)),0)","v":0},18,null,null,0,{"$f":"IFERROR((VLOOKUP(CONCATENATE(P22,Q22),Qui!$D$301:$F$356,3,0)),0)","v":0}]
[19,{"$nulls":11},{"$f":"SUM(D23:L23*(D23:L23>=LARGE(D23:L23,Qui!$A$402)))","v":{"$error":"#NUM!"}},{"$f":"IFERROR((VLOOKUP(CONCATENATE(B23,C23),Qui!$D$301:$F$356,3,)),0)","v":0},19,null,null,0,{"$f":"IFERROR((VLOOKUP(CONCATENATE(P23,Q23),Qui!$D$301:$F$356,3,0)),0)","v":0}]
[20,{"$nulls":11},{"$f":"SUM(D24:L24*(D24:L24>=LARGE(D24:L24,Qui!$A$402)))","v":{"$error":"#NUM!"}},{"$f":"IFERROR((VLOOKUP(CONCATENATE(B24,C24),Qui!$D$301:$F$356,3,)),0)","v":0},20,null,null,0,{"$f":"IFERROR((VLOOKUP(CONCATENATE(P24,Q24),Qui!$D$301:$F$356,3,0)),0)","v":0}]
[21,{"$nulls":11},{"$f":"SUM(D25:L25*(D25:L25>=LARGE(D25:L25,Qui!$A$402)))","v":{"$error":"#NUM!"}},{"$f":"IFERROR((VLOOKUP(CONCATENATE(B25,C25),Qui!$D$301:$F$356,3,)),0)","v":0},21,null,null,0,{"$f":"IFERROR((VLOOKUP(CONCATENATE(P25,Q25),Qui!$D$301:$F$356,3,0)),0)","v":0}]
[22,{"$nulls":11},{"$f":"SUM(D26:L26*(D26:L26>=LARGE(D26:L26,Qui!$A$402)))","v":{"$error":"#NUM!"}},{"$f":"IFERROR((VLOOKUP(CONCATENATE(B26,C26),Qui!$D$301:$F$356,3,)),0)","v":0},22,null,null,0,{"$f":"IFERROR((VLOOKUP(CONCATENATE(P26,Q26),Qui!$D$301:$F$356,3,0)),0)","v":0}]
[23,{"$nulls":11},{"$f":"SUM(D27:L27*(D27:L27>=LARGE(D27:L27,Qui!$A$402)))","v":{"$error":"#NUM!"}},{"$f":"IFERROR((VLOOKUP(CONCATENATE(B27,C27),Qui!$D$301:$F$356,3,)),0)","v":0},23,null,null,0,{"$f":"IFERROR((VLOOKUP(CONCATENATE(P27,Q27),Qui!$D$301:$F$356,3,0)),0)","v":0}]
[24,{"$nulls":11},{"$f":"SUM(D28:L28*(D28:L28>=LARGE(D28:L28,Qui!$A$402)))","v":{"$error":"#NUM!"}},{"$f":"IFERROR((VLOOKUP(CONCATENATE(B28,C28),Qui!$D$301:$F$356,3,)),0)","v":0},24,null,null,0,{"$f":"IFERROR((VLOOKUP(CONCATENATE(P28,Q28),Qui!$D$301:$F$356,3,0)),0)","v":0}]
[25,{"$nulls":11},{"$f":"SUM(D29:L29*(D29:L29>=LARGE(D29:L29,Qui!$A$402)))","v":{"$error":"#NUM!"}},{"$f":"IFERROR((VLOOKUP(CONCATENATE(B29,C29),Qui!$D$301:$F$356,3,)),0)","v":0},25,null,null,0,{"$f":"IFERROR((VLOOKUP(CONCATENATE(P29,Q29),Qui!$D$301:$F$356,3,0)),0)","v":0}]
[26,{"$nulls":11},{"$f":"SUM(D30:L30*(D30:L30>=LARGE(D30:L30,Qui!$A$402)))","v":{"$error":"#NUM!"}},{"$f":"IFERROR((VLOOKUP(CONCATENATE(B30,C30),Qui!$D$301:$F$356,3,)),0)","v":0},26,null,null,0,{"$f":"IFERROR((VLOOKUP(CONCATENATE(P30,Q30),Qui!$D$301:$F$356,3,0)),0)","v":0}]
[27,{"$nulls":11},{"$f":"SUM(D31:L31*(D31:L31>=LARGE(D31:L31,Qui!$A$402)))","v":{"$error":"#NUM!"}},{"$f":"IFERROR((VLOOKUP(CONCATENATE(B31,C31),Qui!$D$301:$F$356,3,)),0)","v":0},27,null,null,0,{"$f":"IFERROR((VLOOKUP(CONCATENATE(P31,Q31),Qui!$D$301:$F$356,3,0)),0)","v":0}]
[28,{"$nulls":11},{"$f":"SUM(D32:L32*(D32:L32>=LARGE(D32:L32,Qui!$A$402)))","v":{"$error":"#NUM!"}},{"$f":"IFERROR((VLOOKUP(CONCATENATE(B32,C32),Qui!$D$301:$F$356,3,)),0)","v":0},28,null,null,0,{"$f":"IFERROR((VLOOKUP(CONCATENATE(P32,Q32),Qui!$D$301:$F$356,3,0)),0)","v":0}]
[29,{"$nulls":11},{"$f":"SUM(D33:L33*(D33:L33>=LARGE(D33:L33,Qui!$A$402)))","v":{"$error":"#NUM!"}},{"$f":"IFERROR((VLOOKUP(CONCATENATE(B33,C33),Qui!$D$301:$F$356,3,)),0)","v":0},29,null,null,0,{"$f":"IFERROR((VLOOKUP(CONCATENATE(P33,Q33),Qui!$D$301:$F$356,3,0)),0)","v":0}]
[30,{"$nulls":11},{"$f":"SUM(D34:L34*(D34:L34>=LARGE(D34:L34,Qui!$A$402)))","v":{"$error":"#NUM!"}},{"$f":"IFERROR((VLOOKUP(CONCATENATE(B34,C34),Qui!$D$301:$F$356,3,)),0)","v":0},30,null,null,0,{"$f":"IFERROR((VLOOKUP(CONCATENATE(P34,Q34),Qui!$D$301:$F$356,3,0)),0)","v":0}]
[31,{"$nulls":11},{"$f":"SUM(D35:L35*(D35:L35>=LARGE(D35:L35,Qui!$A$402)))","v":{"$error":"#NUM!"}},{"$f":"IFERROR((VLOOKUP(CONCATENATE(B35,C35),Qui!$D$301:$F$356,3,)),0)","v":0},31,null,null,0,{"$f":"IFERROR((VLOOKUP(CONCATENATE(P35,Q35),Qui!$D$301:$F$356,3,0)),0)","v":0}]
[32,{"$nulls":11},{"$f":"SUM(D36:L36*(D36:L36>=LARGE(D36:L36,Qui!$A$402)))","v":{"$error":"#NUM!"}},{"$f":"IFERROR((VLOOKUP(CONCATENATE(B36,C36),Qui!$D$301:$F$356,3,)),0)","v":0},32,null,null,0,{"$f":"IFERROR((VLOOKUP(CONCATENATE(P36,Q36),Qui!$D$301:$F$356,3,0)),0)","v":0}]
[33,{"$nulls":11},{"$f":"SUM(D37:L37*(D37:L37>=LARGE(D37:L37,Qui!$A$402)))","v":{"$error":"#NUM!"}},{"$f":"IFERROR((VLOOKUP(CONCATENATE(B37,C37),Qui!$D$301:$F$356,3,)),0)","v":0},33,null,null,0,{"$f":"IFERROR((VLOOKUP(CONCATENATE(P37,Q37),Qui!$D$301:$F$356,3,0)),0)","v":0}]
[34,{"$nulls":11},{"$f":"SUM(D38:L38*(D38:L38>=LARGE(D38:L38,Qui!$A$402)))","v":{"$error":"#NUM!"}},{"$f":"IFERROR((VLOOKUP(CONCATENATE(B38,C38),Qui!$D$301:$F$356,3,)),0)","v":0},34,null,null,0,{"$f":"IFERROR((VLOOKUP(CONCATENATE(P38,Q38),Qui!$D$301:$F$356,3,0)),0)","v":0}]
[35,{"$nulls":11},{"$f":"SUM(D39:L39*(D39:L39>=LARGE(D39:L39,Qui!$A$402)))","v":{"$error":"#NUM!"}},{"$f":"IFERROR((VLOOKUP(CONCATENATE(B39,C39),Qui!$D$301:$F$356,3,)),0)","v":0},35,null,null,0,{"$f":"IFERROR((VLOOKUP(CONCATENATE(P39,Q39),Qui!$D$301:$F$356,3,0)),0)","v":0}]
[36,null,null,0,0,0,0,0,0,0,0,0,{"$f":"SUM(D40:L40*(D40:L40>=LARGE(D40:L40,Qui!$A$402)))","v":0},{"$f":"IFERROR((VLOOKUP(CONCATENATE(B40,C40),Qui!$D$301:$F$356,3,)),0)","v":0},36,null,null,0,{"$f":"IFERROR((VLOOKUP(CONCATENATE(P40,Q40),Qui!$D$301:$F$356,3,0)),0)","v":0}]
[37,null,null,0,0,0,0,0,0,0,0,0,{"$f":"SUM(D41:L41*(D41:L41>=LARGE(D41:L41,Qui!$A$402)))","v":0},{"$f":"IFERROR((VLOOKUP(CONCATENATE(B41,C41),Qui!$D$301:$F$356,3,)),0)","v":0},37,null,null,0,{"$f":"IFERROR((VLOOKUP(CONCATENATE(P41,Q41),Qui!$D$301:$F$356,3,0)),0)","v":0}]
[38,null,null,0,0,0,0,0,0,0,0,0,{"$f":"SUM(D42:L42*(D42:L42>=LARGE(D42:L42,Qui!$A$402)))","v":0},{"$f":"IFERROR((VLOOKUP(CONCATENATE(B42,C42),Qui!$D$301:$F$356,3,)),0)","v":0},38,null,null,0,{"$f":"IFERROR((VLOOKUP(CONCATENATE(P42,Q42),Qui!$D$301:$F$356,3,0)),0)","v":0}]
[39,null,null,0,0,0,0,0,0,0,0,0,{"$f":"SUM(D43:L43*(D43:L43>=LARGE(D43:L43,Qui!$A$402)))","v":0},{"$f":"IFERROR((VLOOKUP(CONCATENATE(B43,C43),Qui!$D$301:$F$356,3,)),0)","v":0},39,null,null,0,{"$f":"IFERROR((VLOOKUP(CONCATENATE(P43,Q43),Qui!$D$301:$F$356,3,0)),0)","v":0}]
[40,null,null,0,0,0,0,0,0,0,0,0,{"$f":"SUM(D44:L44*(D44:L44>=LARGE(D44:L44,Qui!$A$402)))","v":0},{"$f":"IFERROR((VLOOKUP(CONCATENATE(B44,C44),Qui!$D$301:$F$356,3,)),0)","v":0},40,null,null,0,{"$f":"IFERROR((VLOOKUP(CONCATENATE(P44,Q44),Qui!$D$301:$F$356,3,0)),0)","v":0}]
[41,null,null,0,0,0,0,0,0,0,0,0,{"$f":"SUM(D45:L45*(D45:L45>=LARGE(D45:L45,Qui!$A$402)))","v":0},{"$f":"IFERROR((VLOOKUP(CONCATENATE(B45,C45),Qui!$D$301:$F$356,3,)),0)","v":0},41,null,null,0,{"$f":"IFERROR((VLOOKUP(CONCATENATE(P45,Q45),Qui!$D$301:$F$356,3,0)),0)","v":0}]
[42,null,null,0,0,0,0,0,0,0,0,0,{"$f":"SUM(D46:L46*(D46:L46>=LARGE(D46:L46,Qui!$A$402)))","v":0},{"$f":"IFERROR((VLOOKUP(CONCATENATE(B46,C46),Qui!$D$301:$F$356,3,)),0)","v":0},42,null,null,0,{"$f":"IFERROR((VLOOKUP(CONCATENATE(P46,Q46),Qui!$D$301:$F$356,3,0)),0)","v":0}]
[43,null,null,0,0,0,0,0,0,0,0,0,{"$f":"SUM(D47:L47*(D47:L47>=LARGE(D47:L47,Qui!$A$402)))","v":0},{"$f":"IFERROR((VLOOKUP(CONCATENATE(B47,C47),Qui!$D$301:$F$356,3,)),0)","v":0},43,null,null,0,{"$f":"IFERROR((VLOOKUP(CONCATENATE(P47,Q47),Qui!$D$301:$F$356,3,0)),0)","v":0}]
[44,null,null,0,0,0,0,0,0,0,0,0,{"$f":"SUM(D48:L48*(D48:L48>=LARGE(D48:L48,Qui!$A$402)))","v":0},{"$f":"IFERROR((VLOOKUP(CONCATENATE(B48,C48),Qui!$D$301:$F$356,3,)),0)","v":0},44,null,null,0,{"$f":"IFERROR((VLOOKUP(CONCATENATE(P48,Q48),Qui!$D$301:$F$356,3,0)),0)","v":0}]
[45,null,null,0,0,0,0,0,0,0,0,0,{"$f":"SUM(D49:L49*(D49:L49>=LARGE(D49:L49,Qui!$A$402)))","v":0},{"$f":"IFERROR((VLOOKUP(CONCATENATE(B49,C49),Qui!$D$301:$F$356,3,)),0)","v":0},45,null,null,0,{"$f":"IFERROR((VLOOKUP(CONCATENATE(P49,Q49),Qui!$D$301:$F$356,3,0)),0)","v":0}]
[46,null,null,0,0,0,0,0,0,0,0,0,{"$f":"SUM(D50:L50*(D50:L50>=LARGE(D50:L50,Qui!$A$402)))","v":0},{"$f":"IFERROR((VLOOKUP(CONCATENATE(B50,C50),Qui!$D$301:$F$356,3,)),0)","v":0},46,null,null,0,{"$f":"IFERROR((VLOOKUP(CONCATENATE(P50,Q50),Qui!$D$301:$F$356,3,0)),0)","v":0}]
[47,null,null,0,0,0,0,0,0,0,0,0,{"$f":"SUM(D51:L51*(D51:L51>=LARGE(D51:L51,Qui!$A$402)))","v":0},{"$f":"IFERROR((VLOOKUP(CONCATENATE(B51,C51),Qui!$D$301:$F$356,3,)),0)","v":0},47,null,null,0,{"$f":"IFERROR((VLOOKUP(CONCATENATE(P51,Q51),Qui!$D$301:$F$356,3,0)),0)","v":0}]
[48,null,null,0,0,0,0,0,0,0,0,0,{"$f":"SUM(D52:L52*(D52:L52>=LARGE(D52:L52,Qui!$A$402)))","v":0},{"$f":"IFERROR((VLOOKUP(CONCATENATE(B52,C52),Qui!$D$301:$F$356,3,)),0)","v":0},48,null,null,0,{"$f":"IFERROR((VLOOKUP(CONCATENATE(P52,Q52),Qui!$D$301:$F$356,3,0)),0)","v":0}]
[49,null,null,0,0,0,0,0,0,0,0,0,{"$f":"SUM(D53:L53*(D53:L53>=LARGE(D53:L53,Qui!$A$402)))","v":0},{"$f":"IFERROR((VLOOKUP(CONCATENATE(B53,C53),Qui!$D$301:$F$356,3,)),0)","v":0},49,null,null,0,{"$f":"IFERROR((VLOOKUP(CONCATENATE(P53,Q53),Qui!$D$301:$F$356,3,0)),0)","v":0}]
[50,null,null,0,0,0,0,0,0,0,0,0,{"$f":"SUM(D54:L54*(D54:L54>=LARGE(D54:L54,Qui!$A$402)))","v":0},{"$f":"IFERROR((VLOOKUP(CONCATENATE(B54,C54),Qui!$D$301:$F$356,3,)),0)","v":0},50,null,null,0,{"$f":"IFERROR((VLOOKUP(CONCATENATE(P54,Q54),Qui!$D$301:$F$356,3,0)),0)","v":0}]
[51,null,null,0,0,0,0,0,0,0,0,0,{"$f":"SUM(D55:L55*(D55:L55>=LARGE(D55:L55,Qui!$A$402)))","v":0},{"$f":"IFERROR((VLOOKUP(CONCATENATE(B55,C55),Qui!$D$301:$F$356,3,)),0)","v":0},51,null,null,0,{"$f":"IFERROR((VLOOKUP(CONCATENATE(P55,Q55),Qui!$D$301:$F$356,3,0)),0)","v":0}]
[52,null,null,0,0,0,0,0,0,0,0,0,{"$f":"SUM(D56:L56*(D56:L56>=LARGE(D56:L56,Qui!$A$402)))","v":0},{"$f":"IFERROR((VLOOKUP(CONCATENATE(B56,C56),Qui!$D$301:$F$356,3,)),0)","v":0},52,null,null,0,{"$f":"IFERROR((VLOOKUP(CONCATENATE(P56,Q56),Qui!$D$301:$F$356,3,0)),0)","v":0}]
[53,{"$nulls":3},0,0,0,0,0,0,0,0,{"$f":"SUM(D57:L57*(D57:L57>=LARGE(D57:L57,Qui!$A$402)))","v":0},{"$f":"IFERROR((VLOOKUP(CONCATENATE(B57,C57),Qui!$D$301:$F$356,3,)),0)","v":0},53,null,null,0,{"$f":"IFERROR((VLOOKUP(CONCATENATE(P57,Q57),Qui!$D$301:$F$356,3,0)),0)","v":0}]
[54,{"$nulls":3},0,0,0,0,0,0,0,0,{"$f":"SUM(D58:L58*(D58:L58>=LARGE(D58:L58,Qui!$A$402)))","v":0},{"$f":"IFERROR((VLOOKUP(CONCATENATE(B58,C58),Qui!$D$301:$F$356,3,)),0)","v":0},54,null,null,0,{"$f":"IFERROR((VLOOKUP(CONCATENATE(P58,Q58),Qui!$D$301:$F$356,3,0)),0)","v":0}]
[{"$nulls":3},{"$f":"MAX(D5:D58)","v":0},null,{"$f":"MAX(F5:F58)","v":0},{"$f":"MAX(G5:G58)","v":0},null,{"$f":"MAX(I5:I58)","v":0},{"$f":"MAX(J5:J58)","v":0},{"$f":"MAX(K5:K58)","v":0},{"$f":"MAX(L5:L58)","v":0}]
["Classement général par équipe",{"$nulls":13},"Classement par équipe"]
[]
[1,{"$nulls":11},{"$f":"SUM(D62:L62)","v":0},{"$f":"VLOOKUP(B62,Qui!$A$201:$D$204,4)","v":{"$error":"#N/A"}},1,null,null,0,{"$f":"VLOOKUP(P62,Qui!$A$201:$D$204,4)","v":{"$error":"#N/A"}}]
[2,{"$nulls":11},0,{"$f":"VLOOKUP(B63,Qui!$A$201:$D$204,4)","v":{"$error":"#N/A"}},2,null,null,0,{"$f":"VLOOKUP(P63,Qui!$A$201:$D$204,4)","v":{"$error":"#N/A"}}]
[3,{"$nulls":11},0,{"$f":"VLOOKUP(B64,Qui!$A$201:$D$204,4)","v":{"$error":"#N/A"}},3,null,null,0,{"$f":"VLOOKUP(P64,Qui!$A$201:$D$204,4)","v":{"$error":"#N/A"}}]
[4,{"$nulls":11},0,{"$f":"VLOOKUP(B65,Qui!$A$201:$D$204,4)","v":{"$error":"#N/A"}},4,null,null,0,{"$f":"VLOOKUP(P65,Qui!$A$201:$D$204,4)","v":{"$error":"#N/A"}}]
[5,{"$nulls":3},435,{"$error":"#N/A"},{"$error":"#N/A"},{"$error":"#N/A"},{"$nulls":4},{"$error":"#N/A"},{"$f":"VLOOKUP(B66,Qui!$A$201:$D$204,4)","v":{"$error":"#N/A"}},5,null,null,{"$f":"SUMPRODUCT(((($S$5:$S$58=S66)*$R$5:$R$58*1))*((($S$5:$S$58=S66)*$R$5:$R$58*1)>=LARGE((($S$5:$S$58=S66)*$R$5:$R$58*1),Qui!$B$402)))","v":{"$error":"#N/A"}},{"$f":"VLOOKUP(P66,Qui!$A$201:$D$204,4)","v":{"$error":"#N/A"}}]
[6,{"$nulls":3},435,{"$error":"#N/A"},{"$error":"#N/A"},{"$error":"#N/A"},{"$nulls":4},{"$error":"#N/A"},{"$f":"VLOOKUP(B67,Qui!$A$201:$D$204,4)","v":{"$error":"#N/A"}},6,null,null,{"$f":"SUMPRODUCT(((($S$5:$S$58=S67)*$R$5:$R$58*1))*((($S$5:$S$58=S67)*$R$5:$R$58*1)>=LARGE((($S$5:$S$58=S67)*$R$5:$R$58*1),Qui!$B$402)))","v":{"$error":"#N/A"}},{"$f":"VLOOKUP(P67,Qui!$A$201:$D$204,4)","v":{"$error":"#N/A"}}]
[{"$nulls":3},{"$f":"MAX(D62:D67)","v":0},null,{"$f":"MAX(F62:F67)","v":{"$error":"#N/A"}},{"$f":"MAX(G62:G67)","v":{"$error":"#N/A"}},null,{"$f":"MAX(I62:I67)","v":0},{"$f":"MAX(J62:J67)","v":0},{"$f":"MAX(K62:K67)","v":0},{"$f":"MAX(L62:L67)","v":0},{"$nulls":5},0]
[{"$nulls":12},"La Chaux-de-Fonds, le 2023 / CM"]
[]
[null,{"$f":"CONCATENATE(\"Rappels :\")","v":"Rappels :"}]
[]
[null,{"$f":"CONCATENATE(\"a) le classement général par équipe  est fait sur le cumul des \",Qui!$B$402,\" meilleurs résultats individuels de chaque manche\")","v":"a) le classement général par équipe  est fait sur le cumul des 5 meilleurs résultats individuels de chaque manche"}]
[null,{"$f":"CONCATENATE(\"b) le classement général individuel est fait sur le cumul des \",Qui!$A$402,\" meilleurs résultats individuels\")","v":"b) le classement général individuel est fait sur le cumul des 5 meilleurs résultats individuels"}]

{"sheet":"Manche_6","index":8,"n_rows":74,"n_cols":21,"rows_kept":74,"hidden":true,"merged":[[0,0,0,17],[1,0,1,17],[2,0,2,1],[2,15,2,17],[3,15,3,17],[60,1,60,2],[60,15,60,16],[67,1,67,2],[68,12,68,17],[70,1,70,17],[71,1,71,17],[72,1,72,17],[73,1,73,17]]}
["Association intercantonale \ndes joueurs de boules\nGrand Jeu Neuchâtelois"]
[{"$f":"CONCATENATE(\"Championnat grand jeu neuchâtelois \",YEAR(Calendrier!B6))","v":"Championnat grand jeu neuchâtelois 2024"}]
["Classement général individuel",null,"Manches",{"$f":"Calendrier!F40","v":"Grand-Sommartel"},{"$f":"Calendrier!F47","v":"Le Locle"},{"$f":"Calendrier!F54","v":"Evologia"},{"$f":"Calendrier!F61","v":"La  Vue-des-Alpes"},{"$f":"Calendrier!F68","v":"L'Epi"},{"$f":"Calendrier!F75","v":"La  Chaux-de-Fonds"},{"$f":"Calendrier!F82","v":"00:00:00"},null,null,{"$f":"CONCATENATE(\"Général\",CHAR(10),\"les \",Qui!$A$402,\" meilleurs\")","v":"Général\nles 5 meilleurs"},null,null,{"$f":"CONCATENATE(\"Classement de la manche\",CHAR(10),Calendrier!F75,CHAR(10),\"du\",TEXT(Calendrier!F77,\" jj.mm\"),\" au\",TEXT(Calendrier!F80,\" jj.mm.aaaa\"))","v":"Classement de la manche\nLa  Chaux-de-Fonds\ndu 25.11 au 28.11.2024"},{"$nulls":4},{"$f":"CONCATENATE(TEXT(Calendrier!F77,\" jj.mm\"),\" au\",TEXT(Calendrier!F80,\" jj.mm.aaaa\"))","v":" 25.11 au 28.11.2024"}]
[{"$nulls":3},1,2,3,4,5,6,7,8,9,{"$nulls":3},{"$f":"CONCATENATE(\"Champion de jeu : \",CHAR(10),P5,\" \",Q5)","v":"Champion de jeu : \n "}]
[1,{"$nulls":11},{"$f":"SUM(D5:L5*(D5:L5>=LARGE(D5:L5,Qui!$A$402)))","v":{"$error":"#NUM!"}},{"$f":"IFERROR((VLOOKUP(CONCATENATE(B5,C5),Qui!$D$301:$F$356,3,)),0)","v":0},1,{"$nulls":3},{"$f":"IFERROR((VLOOKUP(CONCATENATE(P5,Q5),Qui!$D$301:$F$356,3,0)),0)","v":0}]
[2,{"$nulls":11},{"$f":"SUM(D6:L6*(D6:L6>=LARGE(D6:L6,Qui!$A$402)))","v":{"$error":"#NUM!"}},{"$f":"IFERROR((VLOOKUP(CONCATENATE(B6,C6),Qui!$D$301:$F$356,3,)),0)","v":0},2,{"$nulls":3},{"$f":"IFERROR((VLOOKUP(CONCATENATE(P6,Q6),Qui!$D$301:$F$356,3,0)),0)","v":0}]
[3,{"$nulls":11},{"$f":"SUM(D7:L7*(D7:L7>=LARGE(D7:L7,Qui!$A$402)))","v":{"$error":"#NUM!"}},{"$f":"IFERROR((VLOOKUP(CONCATENATE(B7,C7),Qui!$D$301:$F$356,3,)),0)","v":0},3,{"$nulls":3},{"$f":"IFERROR((VLOOKUP(CONCATENATE(P7,Q7),Qui!$D$301:$F$356,3,0)),0)","v":0}]
[4,{"$nulls":11},{"$f":"SUM(D8:L8*(D8:L8>=LARGE(D8:L8,Qui!$A$402)))","v":{"$error":"#NUM!"}},{"$f":"IFERROR((VLOOKUP(CONCATENATE(B8,C8),Qui!$D$301:$F$356,3,)),0)","v":0},4,{"$nulls":3},{"$f":"IFERROR((VLOOKUP(CONCATENATE(P8,Q8),Qui!$D$301:$F$356,3,0)),0)","v":0}]
[5,{"$nulls":11},{"$f":"SUM(D9:L9*(D9:L9>=LARGE(D9:L9,Qui!$A$402)))","v":{"$error":"#NUM!"}},{"$f":"IFERROR((VLOOKUP(CONCATENATE(B9,C9),Qui!$D$301:$F$356,3,)),0)","v":0},5,{"$nulls":3},{"$f":"IFERROR((VLOOKUP(CONCATENATE(P9,Q9),Qui!$D$301:$F$356,3,0)),0)","v":0}]
[6,{"$nulls":11},{"$f":"SUM(D10:L10*(D10:L10>=LARGE(D10:L10,Qui!$A$402)))","v":{"$error":"#NUM!"}},{"$f":"IFERROR((VLOOKUP(CONCATENATE(B10,C10),Qui!$D$301:$F$356,3,)),0)","v":0},6,{"$nulls":3},{"$f":"IFERROR((VLOOKUP(CONCATENATE(P10,Q10),Qui!$D$301:$F$356,3,0)),0)","v":0}]
[7,{"$nulls":11},{"$f":"SUM(D11:L11*(D11:L11>=LARGE(D11:L11,Qui!$A$402)))","v":{"$error":"#NUM!"}},{"$f":"IFERROR((VLOOKUP(CONCATENATE(B11,C11),Qui!$D$301:$F$356,3,)),0)","v":0},7,{"$nulls":3},{"$f":"IFERROR((VLOOKUP(CONCATENATE(P11,Q11),Qui!$D$301:$F$356,3,0)),0)","v":0}]
[8,{"$nulls":11},{"$f":"SUM(D12:L12*(D12:L12>=LARGE(D12:L12,Qui!$A$402)))","v":{"$error":"#NUM!"}},{"$f":"IFERROR((VLOOKUP(CONCATENATE(B12,C12),Qui!$D$301:$F$356,3,)),0)","v":0},8,{"$nulls":3},{"$f":"IFERROR((VLOOKUP(CONCATENATE(P12,Q12),Qui!$D$301:$F$356,3,0)),0)","v":0}]
[9,{"$nulls":11},{"$f":"SUM(D13:L13*(D13:L13>=LARGE(D13:L13,Qui!$A$402)))","v":{"$error":"#NUM!"}},{"$f":"IFERROR((VLOOKUP(CONCATENATE(B13,C13),Qui!$D$301:$F$356,3,)),0)","v":0},9,{"$nulls":3},{"$f":"IFERROR((VLOOKUP(CONCATENATE(P13,Q13),Qui!$D$301:$F$356,3,0)),0)","v":0}]
[10,{"$nulls":11},{"$f":"SUM(D14:L14*(D14:L14>=LARGE(D14:L14,Qui!$A$402)))","v":{"$error":"#NUM!"}},{"$f":"IFERROR((VLOOKUP(CONCATENATE(B14,C14),Qui!$D$301:$F$356,3,)),0)","v":0},10,{"$nulls":3},{"$f":"IFERROR((VLOOKUP(CONCATENATE(P14,Q14),Qui!$D$301:$F$356,3,0)),0)","v":0}]
[11,{"$nulls":11},{"$f":"SUM(D15:L15*(D15:L15>=LARGE(D15:L15,Qui!$A$402)))","v":{"$error":"#NUM!"}},{"$f":"IFERROR((VLOOKUP(CONCATENATE(B15,C15),Qui!$D$301:$F$356,3,)),0)","v":0},11,{"$nulls":3},{"$f":"IFERROR((VLOOKUP(CONCATENATE(P15,Q15),Qui!$D$301:$F$356,3,0)),0)","v":0}]
[12,{"$nulls":11},{"$f":"SUM(D16:L16*(D16:L16>=LARGE(D16:L16,Qui!$A$402)))","v":{"$error":"#NUM!"}},{"$f":"IFERROR((VLOOKUP(CONCATENATE(B16,C16),Qui!$D$301:$F$356,3,)),0)","v":0},12,{"$nulls":3},{"$f":"IFERROR((VLOOKUP(CONCATENATE(P16,Q16),Qui!$D$301:$F$356,3,0)),0)","v":0}]
[13,{"$nulls":11},{"$f":"SUM(D17:L17*(D17:L17>=LARGE(D17:L17,Qui!$A$402)))","v":{"$error":"#NUM!"}},{"$f":"IFERROR((VLOOKUP(CONCATENATE(B17,C17),Qui!$D$301:$F$356,3,)),0)","v":0},13,{"$nulls":3},{"$f":"IFERROR((VLOOKUP(CONCATENATE(P17,Q17),Qui!$D$301:$F$356,3,0)),0)","v":0}]
[14,{"$nulls":11},{"$f":"SUM(D18:L18*(D18:L18>=LARGE(D18:L18,Qui!$A$402)))","v":{"$error":"#NUM!"}},{"$f":"IFERROR((VLOOKUP(CONCATENATE(B18,C18),Qui!$D$301:$F$356,3,)),0)","v":0},14,{"$nulls":3},{"$f":"IFERROR((VLOOKUP(CONCATENATE(P18,Q18),Qui!$D$301:$F$356,3,0)),0)","v":0}]
[15,{"$nulls":11},{"$f":"SUM(D19:L19*(D19:L19>=LARGE(D19:L19,Qui!$A$402)))","v":{"$error":"#NUM!"}},{"$f":"IFERROR((VLOOKUP(CONCATENATE(B19,C19),Qui!$D$301:$F$356,3,)),0)","v":0},15,{"$nulls":3},{"$f":"IFERROR((VLOOKUP(CONCATENATE(P19,Q19),Qui!$D$301:$F$356,3,0)),0)","v":0}]
[16,{"$nulls":11},{"$f":"SUM(D20:L20*(D20:L20>=LARGE(D20:L20,Qui!$A$402)))","v":{"$error":"#NUM!"}},{"$f":"IFERROR((VLOOKUP(CONCATENATE(B20,C20),Qui!$D$301:$F$356,3,)),0)","v":0},16,{"$nulls":3},{"$f":"IFERROR((VLOOKUP(CONCATENATE(P20,Q20),Qui!$D$301:$F$356,3,0)),0)","v":0}]
[17,{"$nulls":11},{"$f":"SUM(D21:L21*(D21:L21>=LARGE(D21:L21,Qui!$A$402)))","v":{"$error":"#NUM!"}},{"$f":"IFERROR((VLOOKUP(CONCATENATE(B21,C21),Qui!$D$301:$F$356,3,)),0)","v":0},17,{"$nulls":3},{"$f":"IFERROR((VLOOKUP(CONCATENATE(P21,Q21),Qui!$D$301:$F$356,3,0)),0)","v":0}]
[18,{"$nulls":11},{"$f":"SUM(D22:L22*(D22:L22>=LARGE(D22:L22,Qui!$A$402)))","v":{"$error":"#NUM!"}},{"$f":"IFERROR((VLOOKUP(CONCATENATE(B22,C22),Qui!$D$301:$F$356,3,)),0)","v":0},18,{"$nulls":3},{"$f":"IFERROR((VLOOKUP(CONCATENATE(P22,Q22),Qui!$D$301:$F$356,3,0)),0)","v":0}]
[19,{"$nulls":11},{"$f":"SUM(D23:L23*(D23:L23>=LARGE(D23:L23,Qui!$A$402)))","v":{"$error":"#NUM!"}},{"$f":"IFERROR((VLOOKUP(CONCATENATE(B23,C23),Qui!$D$301:$F$356,3,)),0)","v":0},19,{"$nulls":3},{"$f":"IFERROR((VLOOKUP(CONCATENATE(P23,Q23),Qui!$D$301:$F$356,3,0)),0)","v":0}]
[20,{"$nulls":11},{"$f":"SUM(D24:L24*(D24:L24>=LARGE(D24:L24,Qui!$A$402)))","v":{"$error":"#NUM!"}},{"$f":"IFERROR((VLOOKUP(CONCATENATE(B24,C24),Qui!$D$301:$F$356,3,)),0)","v":0},20,{"$nulls":3},{"$f":"IFERROR((VLOOKUP(CONCATENATE(P24,Q24),Qui!$D$301:$F$356,3,0)),0)","v":0}]
[21,{"$nulls":11},{"$f":"SUM(D25:L25*(D25:L25>=LARGE(D25:L25,Qui!$A$402)))","v":{"$error":"#NUM!"}},{"$f":"IFERROR((VLOOKUP(CONCATENATE(B25,C25),Qui!$D$301:$F$356,3,)),0)","v":0},21,{"$nulls":3},{"$f":"IFERROR((VLOOKUP(CONCATENATE(P25,Q25),Qui!$D$301:$F$356,3,0)),0)","v":0}]
[22,{"$nulls":11},{"$f":"SUM(D26:L26*(D26:L26>=LARGE(D26:L26,Qui!$A$402)))","v":{"$error":"#NUM!"}},{"$f":"IFERROR((VLOOKUP(CONCATENATE(B26,C26),Qui!$D$301:$F$356,3,)),0)","v":0},22,{"$nulls":3},{"$f":"IFERROR((VLOOKUP(CONCATENATE(P26,Q26),Qui!$D$301:$F$356,3,0)),0)","v":0}]
[23,{"$nulls":11},{"$f":"SUM(D27:L27*(D27:L27>=LARGE(D27:L27,Qui!$A$402)))","v":{"$error":"#NUM!"}},{"$f":"IFERROR((VLOOKUP(CONCATENATE(B27,C27),Qui!$D$301:$F$356,3,)),0)","v":0},23,{"$nulls":3},{"$f":"IFERROR((VLOOKUP(CONCATENATE(P27,Q27),Qui!$D$301:$F$356,3,0)),0)","v":0}]
[24,{"$nulls":11},{"$f":"SUM(D28:L28*(D28:L28>=LARGE(D28:L28,Qui!$A$402)))","v":{"$error":"#NUM!"}},{"$f":"IFERROR((VLOOKUP(CONCATENATE(B28,C28),Qui!$D$301:$F$356,3,)),0)","v":0},24,{"$nulls":3},{"$f":"IFERROR((VLOOKUP(CONCATENATE(P28,Q28),Qui!$D$301:$F$356,3,0)),0)","v":0}]
[25,{"$nulls":11},{"$f":"SUM(D29:L29*(D29:L29>=LARGE(D29:L29,Qui!$A$402)))","v":{"$error":"#NUM!"}},{"$f":"IFERROR((VLOOKUP(CONCATENATE(B29,C29),Qui!$D$301:$F$356,3,)),0)","v":0},25,{"$nulls":3},{"$f":"IFERROR((VLOOKUP(CONCATENATE(P29,Q29),Qui!$D$301:$F$356,3,0)),0)","v":0}]
[26,{"$nulls":11},{"$f":"SUM(D30:L30*(D30:L30>=LARGE(D30:L30,Qui!$A$402)))","v":{"$error":"#NUM!"}},{"$f":"IFERROR((VLOOKUP(CONCATENATE(B30,C30),Qui!$D$301:$F$356,3,)),0)","v":0},26,{"$nulls":3},{"$f":"IFERROR((VLOOKUP(CONCATENATE(P30,Q30),Qui!$D$301:$F$356,3,0)),0)","v":0}]
[27,{"$nulls":11},{"$f":"SUM(D31:L31*(D31:L31>=LARGE(D31:L31,Qui!$A$402)))","v":{"$error":"#NUM!"}},{"$f":"IFERROR((VLOOKUP(CONCATENATE(B31,C31),Qui!$D$301:$F$356,3,)),0)","v":0},27,{"$nulls":3},{"$f":"IFERROR((VLOOKUP(CONCATENATE(P31,Q31),Qui!$D$301:$F$356,3,0)),0)","v":0}]
[28,{"$nulls":11},{"$f":"SUM(D32:L32*(D32:L32>=LARGE(D32:L32,Qui!$A$402)))","v":{"$error":"#NUM!"}},{"$f":"IFERROR((VLOOKUP(CONCATENATE(B32,C32),Qui!$D$301:$F$356,3,)),0)","v":0},28,{"$nulls":3},{"$f":"IFERROR((VLOOKUP(CONCATENATE(P32,Q32),Qui!$D$301:$F$356,3,0)),0)","v":0}]
[29,{"$nulls":11},{"$f":"SUM(D33:L33*(D33:L33>=LARGE(D33:L33,Qui!$A$402)))","v":{"$error":"#NUM!"}},{"$f":"IFERROR((VLOOKUP(CONCATENATE(B33,C33),Qui!$D$301:$F$356,3,)),0)","v":0},29,{"$nulls":3},{"$f":"IFERROR((VLOOKUP(CONCATENATE(P33,Q33),Qui!$D$301:$F$356,3,0)),0)","v":0}]
[30,{"$nulls":11},{"$f":"SUM(D34:L34*(D34:L34>=LARGE(D34:L34,Qui!$A$402)))","v":{"$error":"#NUM!"}},{"$f":"IFERROR((VLOOKUP(CONCATENATE(B34,C34),Qui!$D$301:$F$356,3,)),0)","v":0},30,{"$nulls":3},{"$f":"IFERROR((VLOOKUP(CONCATENATE(P34,Q34),Qui!$D$301:$F$356,3,0)),0)","v":0}]
[31,null,null,0,0,0,0,0,0,{"$nulls":3},{"$f":"SUM(D35:L35*(D35:L35>=LARGE(D35:L35,Qui!$A$402)))","v":0},{"$f":"IFERROR((VLOOKUP(CONCATENATE(B35,C35),Qui!$D$301:$F$356,3,)),0)","v":0},31,{"$nulls":3},{"$f":"IFERROR((VLOOKUP(CONCATENATE(P35,Q35),Qui!$D$301:$F$356,3,0)),0)","v":0}]
[32,{"$nulls":11},{"$f":"SUM(D36:L36*(D36:L36>=LARGE(D36:L36,Qui!$A$402)))","v":{"$error":"#NUM!"}},{"$f":"IFERROR((VLOOKUP(CONCATENATE(B36,C36),Qui!$D$301:$F$356,3,)),0)","v":0},32,{"$nulls":3},{"$f":"IFERROR((VLOOKUP(CONCATENATE(P36,Q36),Qui!$D$301:$F$356,3,0)),0)","v":0}]
[33,{"$nulls":11},{"$f":"SUM(D37:L37*(D37:L37>=LARGE(D37:L37,Qui!$A$402)))","v":{"$error":"#NUM!"}},{"$f":"IFERROR((VLOOKUP(CONCATENATE(B37,C37),Qui!$D$301:$F$356,3,)),0)","v":0},33,null,null,0,{"$f":"IFERROR((VLOOKUP(CONCATENATE(P37,Q37),Qui!$D$301:$F$356,3,0)),0)","v":0}]
[34,{"$nulls":11},{"$f":"SUM(D38:L38*(D38:L38>=LARGE(D38:L38,Qui!$A$402)))","v":{"$error":"#NUM!"}},{"$f":"IFERROR((VLOOKUP(CONCATENATE(B38,C38),Qui!$D$301:$F$356,3,)),0)","v":0},34,null,null,0,{"$f":"IFERROR((VLOOKUP(CONCATENATE(P38,Q38),Qui!$D$301:$F$356,3,0)),0)","v":0}]
[35,{"$nulls":11},{"$f":"SUM(D39:L39*(D39:L39>=LARGE(D39:L39,Qui!$A$402)))","v":{"$error":"#NUM!"}},{"$f":"IFERROR((VLOOKUP(CONCATENATE(B39,C39),Qui!$D$301:$F$356,3,)),0)","v":0},35,null,null,0,{"$f":"IFERROR((VLOOKUP(CONCATENATE(P39,Q39),Qui!$D$301:$F$356,3,0)),0)","v":0}]
[36,null,null,0,0,0,0,0,0,0,0,0,{"$f":"SUM(D40:L40*(D40:L40>=LARGE(D40:L40,Qui!$A$402)))","v":0},{"$f":"IFERROR((VLOOKUP(CONCATENATE(B40,C40),Qui!$D$301:$F$356,3,)),0)","v":0},36,null,null,0,{"$f":"IFERROR((VLOOKUP(CONCATENATE(P40,Q40),Qui!$D$301:$F$356,3,0)),0)","v":0}]
[37,null,null,0,0,0,0,0,0,0,0,0,{"$f":"SUM(D41:L41*(D41:L41>=LARGE(D41:L41,Qui!$A$402)))","v":0},{"$f":"IFERROR((VLOOKUP(CONCATENATE(B41,C41),Qui!$D$301:$F$356,3,)),0)","v":0},37,null,null,0,{"$f":"IFERROR((VLOOKUP(CONCATENATE(P41,Q41),Qui!$D$301:$F$356,3,0)),0)","v":0}]
[38,null,null,0,0,0,0,0,0,0,0,0,{"$f":"SUM(D42:L42*(D42:L42>=LARGE(D42:L42,Qui!$A$402)))","v":0},{"$f":"IFERROR((VLOOKUP(CONCATENATE(B42,C42),Qui!$D$301:$F$356,3,)),0)","v":0},38,null,null,0,{"$f":"IFERROR((VLOOKUP(CONCATENATE(P42,Q42),Qui!$D$301:$F$356,3,0)),0)","v":0}]
[39,null,null,0,0,0,0,0,0,0,0,0,{"$f":"SUM(D43:L43*(D43:L43>=LARGE(D43:L43,Qui!$A$402)))","v":0},{"$f":"IFERROR((VLOOKUP(CONCATENATE(B43,C43),Qui!$D$301:$F$356,3,)),0)","v":0},39,null,null,0,{"$f":"IFERROR((VLOOKUP(CONCATENATE(P43,Q43),Qui!$D$301:$F$356,3,0)),0)","v":0}]
[40,null,null,0,0,0,0,0,0,0,0,0,{"$f":"SUM(D44:L44*(D44:L44>=LARGE(D44:L44,Qui!$A$402)))","v":0},{"$f":"IFERROR((VLOOKUP(CONCATENATE(B44,C44),Qui!$D$301:$F$356,3,)),0)","v":0},40,null,null,0,{"$f":"IFERROR((VLOOKUP(CONCATENATE(P44,Q44),Qui!$D$301:$F$356,3,0)),0)","v":0}]
[41,null,null,0,0,0,0,0,0,0,0,0,{"$f":"SUM(D45:L45*(D45:L45>=LARGE(D45:L45,Qui!$A$402)))","v":0},{"$f":"IFERROR((VLOOKUP(CONCATENATE(B45,C45),Qui!$D$301:$F$356,3,)),0)","v":0},41,null,null,0,{"$f":"IFERROR((VLOOKUP(CONCATENATE(P45,Q45),Qui!$D$301:$F$356,3,0)),0)","v":0}]
[42,null,null,0,0,0,0,0,0,0,0,0,{"$f":"SUM(D46:L46*(D46:L46>=LARGE(D46:L46,Qui!$A$402)))","v":0},{"$f":"IFERROR((VLOOKUP(CONCATENATE(B46,C46),Qui!$D$301:$F$356,3,)),0)","v":0},42,null,null,0,{"$f":"IFERROR((VLOOKUP(CONCATENATE(P46,Q46),Qui!$D$301:$F$356,3,0)),0)","v":0}]
[43,null,null,0,0,0,0,0,0,0,0,0,{"$f":"SUM(D47:L47*(D47:L47>=LARGE(D47:L47,Qui!$A$402)))","v":0},{"$f":"IFERROR((VLOOKUP(CONCATENATE(B47,C47),Qui!$D$301:$F$356,3,)),0)","v":0},43,null,null,0,{"$f":"IFERROR((VLOOKUP(CONCATENATE(P47,Q47),Qui!$D$301:$F$356,3,0)),0)","v":0}]
[44,null,null,0,0,0,0,0,0,0,0,0,{"$f":"SUM(D48:L48*(D48:L48>=LARGE(D48:L48,Qui!$A$402)))","v":0},{"$f":"IFERROR((VLOOKUP(CONCATENATE(B48,C48),Qui!$D$301:$F$356,3,)),0)","v":0},44,null,null,0,{"$f":"IFERROR((VLOOKUP(CONCATENATE(P48,Q48),Qui!$D$301:$F$356,3,0)),0)","v":0}]
[45,null,null,0,0,0,0,0,0,0,0,0,{"$f":"SUM(D49:L49*(D49:L49>=LARGE(D49:L49,Qui!$A$402)))","v":0},{"$f":"IFERROR((VLOOKUP(CONCATENATE(B49,C49),Qui!$D$301:$F$356,3,)),0)","v":0},45,null,null,0,{"$f":"IFERROR((VLOOKUP(CONCATENATE(P49,Q49),Qui!$D$301:$F$356,3,0)),0)","v":0}]
[46,null,null,0,0,0,0,0,0,0,0,0,{"$f":"SUM(D50:L50*(D50:L50>=LARGE(D50:L50,Qui!$A$402)))","v":0},{"$f":"IFERROR((VLOOKUP(CONCATENATE(B50,C50),Qui!$D$301:$F$356,3,)),0)","v":0},46,null,null,0,{"$f":"IFERROR((VLOOKUP(CONCATENATE(P50,Q50),Qui!$D$301:$F$356,3,0)),0)","v":0}]
[47,null,null,0,0,0,0,0,0,0,0,0,{"$f":"SUM(D51:L51*(D51:L51>=LARGE(D51:L51,Qui!$A$402)))","v":0},{"$f":"IFERROR((VLOOKUP(CONCATENATE(B51,C51),Qui!$D$301:$F$356,3,)),0)","v":0},47,null,null,0,{"$f":"IFERROR((VLOOKUP(CONCATENATE(P51,Q51),Qui!$D$301:$F$356,3,0)),0)","v":0}]
[48,null,null,0,0,0,0,0,0,0,0,0,{"$f":"SUM(D52:L52*(D52:L52>=LARGE(D52:L52,Qui!$A$402)))","v":0},{"$f":"IFERROR((VLOOKUP(CONCATENATE(B52,C52),Qui!$D$301:$F$356,3,)),0)","v":0},48,null,null,0,{"$f":"IFERROR((VLOOKUP(CONCATENATE(P52,Q52),Qui!$D$301:$F$356,3,0)),0)","v":0}]
[49,null,null,0,0,0,0,0,0,0,0,0,{"$f":"SUM(D53:L53*(D53:L53>=LARGE(D53:L53,Qui!$A$402)))","v":0},{"$f":"IFERROR((VLOOKUP(CONCATENATE(B53,C53),Qui!$D$301:$F$356,3,)),0)","v":0},49,null,null,0,{"$f":"IFERROR((VLOOKUP(CONCATENATE(P53,Q53),Qui!$D$301:$F$356,3,0)),0)","v":0}]
[50,null,null,0,0,0,0,0,0,0,0,0,{"$f":"SUM(D54:L54*(D54:L54>=LARGE(D54:L54,Qui!$A$402)))","v":0},{"$f":"IFERROR((VLOOKUP(CONCATENATE(B54,C54),Qui!$D$301:$F$356,3,)),0)","v":0},50,null,null,0,{"$f":"IFERROR((VLOOKUP(CONCATENATE(P54,Q54),Qui!$D$301:$F$356,3,0)),0)","v":0}]
[51,null,null,0,0,0,0,0,0,0,0,0,{"$f":"SUM(D55:L55*(D55:L55>=LARGE(D55:L55,Qui!$A$402)))","v":0},{"$f":"IFERROR((VLOOKUP(CONCATENATE(B55,C55),Qui!$D$301:$F$356,3,)),0)","v":0},51,null,null,0,{"$f":"IFERROR((VLOOKUP(CONCATENATE(P55,Q55),Qui!$D$301:$F$356,3,0)),0)","v":0}]
[52,null,null,0,0,0,0,0,0,0,0,0,{"$f":"SUM(D56:L56*(D56:L56>=LARGE(D56:L56,Qui!$A$402)))","v":0},{"$f":"IFERROR((VLOOKUP(CONCATENATE(B56,C56),Qui!$D$301:$F$356,3,)),0)","v":0},52,null,null,0,{"$f":"IFERROR((VLOOKUP(CONCATENATE(P56,Q56),Qui!$D$301:$F$356,3,0)),0)","v":0}]
[53,{"$nulls":3},0,0,0,0,0,0,0,0,{"$f":"SUM(D57:L57*(D57:L57>=LARGE(D57:L57,Qui!$A$402)))","v":0},{"$f":"IFERROR((VLOOKUP(CONCATENATE(B57,C57),Qui!$D$301:$F$356,3,)),0)","v":0},53,null,null,0,{"$f":"IFERROR((VLOOKUP(CONCATENATE(P57,Q57),Qui!$D$301:$F$356,3,0)),0)","v":0}]
[54,{"$nulls":3},0,0,0,0,0,0,0,0,{"$f":"SUM(D58:L58*(D58:L58>=LARGE(D58:L58,Qui!$A$402)))","v":0},{"$f":"IFERROR((VLOOKUP(CONCATENATE(B58,C58),Qui!$D$301:$F$356,3,)),0)","v":0},54,null,null,0,{"$f":"IFERROR((VLOOKUP(CONCATENATE(P58,Q58),Qui!$D$301:$F$356,3,0)),0)","v":0}]
[{"$nulls":3},{"$f":"MAX(D5:D58)","v":0},null,{"$f":"MAX(F5:F58)","v":0},{"$f":"MAX(G5:G58)","v":0},null,{"$f":"MAX(I5:I58)","v":0},{"$f":"MAX(J5:J58)","v":0},{"$f":"MAX(K5:K58)","v":0},{"$f":"MAX(L5:L58)","v":0}]
["Classement général par équipe",{"$nulls":13},"Classement par équipe"]
[]
[1,{"$nulls":11},{"$f":"SUM(D62:L62*(D62:L62>=LARGE(D62:L62,Qui!$B$402)))","v":{"$error":"#NUM!"}},{"$f":"VLOOKUP(B62,Qui!$A$201:$D$204,4)","v":{"$error":"#N/A"}},1,{"$nulls":3},{"$f":"VLOOKUP(P62,Qui!$A$201:$D$204,4)","v":{"$error":"#N/A"}}]
[2,{"$nulls":11},{"$f":"SUM(D63:L63*(D63:L63>=LARGE(D63:L63,Qui!$B$402)))","v":{"$error":"#NUM!"}},{"$f":"VLOOKUP(B63,Qui!$A$201:$D$204,4)","v":{"$error":"#N/A"}},2,{"$nulls":3},{"$f":"VLOOKUP(P63,Qui!$A$201:$D$204,4)","v":{"$error":"#N/A"}}]
[3,{"$nulls":11},{"$f":"SUM(D64:L64*(D64:L64>=LARGE(D64:L64,Qui!$B$402)))","v":{"$error":"#NUM!"}},{"$f":"VLOOKUP(B64,Qui!$A$201:$D$204,4)","v":{"$error":"#N/A"}},3,{"$nulls":3},{"$f":"VLOOKUP(P64,Qui!$A$201:$D$204,4)","v":{"$error":"#N/A"}}]
[4,{"$nulls":11},{"$f":"SUM(D65:L65*(D65:L65>=LARGE(D65:L65,Qui!$B$402)))","v":{"$error":"#NUM!"}},{"$f":"VLOOKUP(B65,Qui!$A$201:$D$204,4)","v":{"$error":"#N/A"}},4,{"$nulls":3},{"$f":"VLOOKUP(P65,Qui!$A$201:$D$204,4)","v":{"$error":"#N/A"}}]
[5,{"$nulls":3},435,{"$error":"#N/A"},{"$error":"#N/A"},{"$error":"#N/A"},{"$nulls":4},{"$f":"SUM(D66:L66*(D66:L66>=LARGE(D66:L66,Qui!$B$402)))","v":{"$error":"#N/A"}},{"$f":"VLOOKUP(B66,Qui!$A$201:$D$204,4)","v":{"$error":"#N/A"}},5,null,null,{"$f":"SUMPRODUCT(((($S$5:$S$58=S66)*$R$5:$R$58*1))*((($S$5:$S$58=S66)*$R$5:$R$58*1)>=LARGE((($S$5:$S$58=S66)*$R$5:$R$58*1),Qui!$B$402)))","v":{"$error":"#N/A"}},{"$f":"VLOOKUP(P66,Qui!$A$201:$D$204,4)","v":{"$error":"#N/A"}}]
[6,{"$nulls":3},435,{"$error":"#N/A"},{"$error":"#N/A"},{"$error":"#N/A"},{"$nulls":4},{"$f":"SUM(D67:L67*(D67:L67>=LARGE(D67:L67,Qui!$B$402)))","v":{"$error":"#N/A"}},{"$f":"VLOOKUP(B67,Qui!$A$201:$D$204,4)","v":{"$error":"#N/A"}},6,null,null,{"$f":"SUMPRODUCT(((($S$5:$S$58=S67)*$R$5:$R$58*1))*((($S$5:$S$58=S67)*$R$5:$R$58*1)>=LARGE((($S$5:$S$58=S67)*$R$5:$R$58*1),Qui!$B$402)))","v":{"$error":"#N/A"}},{"$f":"VLOOKUP(P67,Qui!$A$201:$D$204,4)","v":{"$error":"#N/A"}}]
[{"$nulls":3},{"$f":"MAX(D62:D67)","v":0},null,{"$f":"MAX(F62:F67)","v":{"$error":"#N/A"}},{"$f":"MAX(G62:G67)","v":{"$error":"#N/A"}},null,{"$f":"MAX(I62:I67)","v":0},{"$f":"MAX(J62:J67)","v":0},{"$f":"MAX(K62:K67)","v":0},{"$f":"MAX(L62:L67)","v":0},{"$nulls":5},0]
[{"$nulls":12},"La Chaux-de-Fonds, le 2023 / CM"]
[]
[null,{"$f":"CONCATENATE(\"Rappels :\")","v":"Rappels :"}]
[]
[null,{"$f":"CONCATENATE(\"a) le classement général par équipe  est fait sur le cumul des \",Qui!$B$402,\" meilleurs résultats individuels de chaque manche\")","v":"a) le classement général par équipe  est fait sur le cumul des 5 meilleurs résultats individuels de chaque manche"}]
[null,{"$f":"CONCATENATE(\"b) le classement général individuel est fait sur le cumul des \",Qui!$A$402,\" meilleurs résultats individuels\")","v":"b) le classement général individuel est fait sur le cumul des 5 meilleurs résultats individuels"}]

{"sheet":"Manche_7","index":9,"n_rows":74,"n_cols":19,"rows_kept":74,"hidden":true,"merged":[[0,0,0,17],[1,0,1,17],[2,0,2,1],[2,15,2,17],[3,15,3,17],[60,1,60,2],[60,15,60,16],[67,1,67,2],[68,12,68,17],[70,1,70,17],[71,1,71,17],[72,1,72,17],[73,1,73,17]]}
["Association intercantonale \ndes joueurs de boules\nGrand Jeu Neuchâtelois"]
[{"$f":"CONCATENATE(\"Championnat grand jeu neuchâtelois \",YEAR(Calendrier!B6))","v":"Championnat grand jeu neuchâtelois 2024"}]
["Classement général individuel",null,"Manches",{"$f":"Calendrier!F40","v":"Grand-Sommartel"},{"$f":"Calendrier!F47","v":"Le Locle"},{"$f":"Calendrier!F54","v":"Evologia"},{"$f":"Calendrier!F61","v":"La  Vue-des-Alpes"},{"$f":"Calendrier!F68","v":"L'Epi"},{"$f":"Calendrier!F75","v":"La  Chaux-de-Fonds"},{"$f":"Calendrier!F82","v":"00:00:00"},null,null,{"$f":"CONCATENATE(\"Général\",CHAR(10),\"les \",Qui!$A$402,\" meilleurs\")","v":"Général\nles 5 meilleurs"},null,null,{"$f":"CONCATENATE(\"Classement de la manche\",CHAR(10),Calendrier!F82,CHAR(10),\"du \",TEXT(Calendrier!F84,\" jj.mm\"),\" au \",TEXT(Calendrier!F87,\" jj.mm.aaaa\"))","v":"Classement de la manche\n\ndu  07.01 au  10.01.1900"}]
[{"$nulls":3},1,2,3,4,5,6,7,8,9,{"$nulls":3},{"$f":"CONCATENATE(\"Champion de jeu : \",CHAR(10),P5,\" \",Q5)","v":"Champion de jeu : \n "}]
[1,{"$nulls":11},{"$f":"SUM(D5:L5*(D5:L5>=LARGE(D5:L5,Qui!$A$402)))","v":{"$error":"#NUM!"}},{"$f":"IFERROR((VLOOKUP(CONCATENATE(B5,C5),Qui!$D$301:$F$356,3,)),0)","v":0},1,null,null,0,{"$f":"IFERROR((VLOOKUP(CONCATENATE(P5,Q5),Qui!$D$301:$F$356,3,0)),0)","v":0}]
[2,{"$nulls":11},{"$f":"SUM(D6:L6*(D6:L6>=LARGE(D6:L6,Qui!$A$402)))","v":{"$error":"#NUM!"}},{"$f":"IFERROR((VLOOKUP(CONCATENATE(B6,C6),Qui!$D$301:$F$356,3,)),0)","v":0},2,null,null,0,{"$f":"IFERROR((VLOOKUP(CONCATENATE(P6,Q6),Qui!$D$301:$F$356,3,0)),0)","v":0}]
[3,{"$nulls":11},{"$f":"SUM(D7:L7*(D7:L7>=LARGE(D7:L7,Qui!$A$402)))","v":{"$error":"#NUM!"}},{"$f":"IFERROR((VLOOKUP(CONCATENATE(B7,C7),Qui!$D$301:$F$356,3,)),0)","v":0},3,null,null,0,{"$f":"IFERROR((VLOOKUP(CONCATENATE(P7,Q7),Qui!$D$301:$F$356,3,0)),0)","v":0}]
[4,{"$nulls":11},{"$f":"SUM(D8:L8*(D8:L8>=LARGE(D8:L8,Qui!$A$402)))","v":{"$error":"#NUM!"}},{"$f":"IFERROR((VLOOKUP(CONCATENATE(B8,C8),Qui!$D$301:$F$356,3,)),0)","v":0},4,null,null,0,{"$f":"IFERROR((VLOOKUP(CONCATENATE(P8,Q8),Qui!$D$301:$F$356,3,0)),0)","v":0}]
[5,{"$nulls":11},{"$f":"SUM(D9:L9*(D9:L9>=LARGE(D9:L9,Qui!$A$402)))","v":{"$error":"#NUM!"}},{"$f":"IFERROR((VLOOKUP(CONCATENATE(B9,C9),Qui!$D$301:$F$356,3,)),0)","v":0},5,null,null,0,{"$f":"IFERROR((VLOOKUP(CONCATENATE(P9,Q9),Qui!$D$301:$F$356,3,0)),0)","v":0}]
[6,{"$nulls":11},{"$f":"SUM(D10:L10*(D10:L10>=LARGE(D10:L10,Qui!$A$402)))","v":{"$error":"#NUM!"}},{"$f":"IFERROR((VLOOKUP(CONCATENATE(B10,C10),Qui!$D$301:$F$356,3,)),0)","v":0},6,null,null,0,{"$f":"IFERROR((VLOOKUP(CONCATENATE(P10,Q10),Qui!$D$301:$F$356,3,0)),0)","v":0}]
[7,{"$nulls":11},{"$f":"SUM(D11:L11*(D11:L11>=LARGE(D11:L11,Qui!$A$402)))","v":{"$error":"#NUM!"}},{"$f":"IFERROR((VLOOKUP(CONCATENATE(B11,C11),Qui!$D$301:$F$356,3,)),0)","v":0},7,null,null,0,{"$f":"IFERROR((VLOOKUP(CONCATENATE(P11,Q11),Qui!$D$301:$F$356,3,0)),0)","v":0}]
[8,{"$nulls":11},{"$f":"SUM(D12:L12*(D12:L12>=LARGE(D12:L12,Qui!$A$402)))","v":{"$error":"#NUM!"}},{"$f":"IFERROR((VLOOKUP(CONCATENATE(B12,C12),Qui!$D$301:$F$356,3,)),0)","v":0},8,null,null,0,{"$f":"IFERROR((VLOOKUP(CONCATENATE(P12,Q12),Qui!$D$301:$F$356,3,0)),0)","v":0}]
[9,{"$nulls":11},{"$f":"SUM(D13:L13*(D13:L13>=LARGE(D13:L13,Qui!$A$402)))","v":{"$error":"#NUM!"}},{"$f":"IFERROR((VLOOKUP(CONCATENATE(B13,C13),Qui!$D$301:$F$356,3,)),0)","v":0},9,null,null,0,{"$f":"IFERROR((VLOOKUP(CONCATENATE(P13,Q13),Qui!$D$301:$F$356,3,0)),0)","v":0}]
[10,{"$nulls":11},{"$f":"SUM(D14:L14*(D14:L14>=LARGE(D14:L14,Qui!$A$402)))","v":{"$error":"#NUM!"}},{"$f":"IFERROR((VLOOKUP(CONCATENATE(B14,C14),Qui!$D$301:$F$356,3,)),0)","v":0},10,null,null,0,{"$f":"IFERROR((VLOOKUP(CONCATENATE(P14,Q14),Qui!$D$301:$F$356,3,0)),0)","v":0}]
[11,{"$nulls":11},{"$f":"SUM(D15:L15*(D15:L15>=LARGE(D15:L15,Qui!$A$402)))","v":{"$error":"#NUM!"}},{"$f":"IFERROR((VLOOKUP(CONCATENATE(B15,C15),Qui!$D$301:$F$356,3,)),0)","v":0},11,null,null,0,{"$f":"IFERROR((VLOOKUP(CONCATENATE(P15,Q15),Qui!$D$301:$F$356,3,0)),0)","v":0}]
[12,{"$nulls":11},{"$f":"SUM(D16:L16*(D16:L16>=LARGE(D16:L16,Qui!$A$402)))","v":{"$error":"#NUM!"}},{"$f":"IFERROR((VLOOKUP(CONCATENATE(B16,C16),Qui!$D$301:$F$356,3,)),0)","v":0},12,null,null,0,{"$f":"IFERROR((VLOOKUP(CONCATENATE(P16,Q16),Qui!$D$301:$F$356,3,0)),0)","v":0}]
[13,{"$nulls":11},{"$f":"SUM(D17:L17*(D17:L17>=LARGE(D17:L17,Qui!$A$402)))","v":{"$error":"#NUM!"}},{"$f":"IFERROR((VLOOKUP(CONCATENATE(B17,C17),Qui!$D$301:$F$356,3,)),0)","v":0},13,null,null,0,{"$f":"IFERROR((VLOOKUP(CONCATENATE(P17,Q17),Qui!$D$301:$F$356,3,0)),0)","v":0}]
[14,{"$nulls":11},{"$f":"SUM(D18:L18*(D18:L18>=LARGE(D18:L18,Qui!$A$402)))","v":{"$error":"#NUM!"}},{"$f":"IFERROR((VLOOKUP(CONCATENATE(B18,C18),Qui!$D$301:$F$356,3,)),0)","v":0},14,null,null,0,{"$f":"IFERROR((VLOOKUP(CONCATENATE(P18,Q18),Qui!$D$301:$F$356,3,0)),0)","v":0}]
[15,{"$nulls":11},{"$f":"SUM(D19:L19*(D19:L19>=LARGE(D19:L19,Qui!$A$402)))","v":{"$error":"#NUM!"}},{"$f":"IFERROR((VLOOKUP(CONCATENATE(B19,C19),Qui!$D$301:$F$356,3,)),0)","v":0},15,null,null,0,{"$f":"IFERROR((VLOOKUP(CONCATENATE(P19,Q19),Qui!$D$301:$F$356,3,0)),0)","v":0}]
[16,{"$nulls":11},{"$f":"SUM(D20:L20*(D20:L20>=LARGE(D20:L20,Qui!$A$402)))","v":{"$error":"#NUM!"}},{"$f":"IFERROR((VLOOKUP(CONCATENATE(B20,C20),Qui!$D$301:$F$356,3,)),0)","v":0},16,null,null,0,{"$f":"IFERROR((VLOOKUP(CONCATENATE(P20,Q20),Qui!$D$301:$F$356,3,0)),0)","v":0}]
[17,{"$nulls":11},{"$f":"SUM(D21:L21*(D21:L21>=LARGE(D21:L21,Qui!$A$402)))","v":{"$error":"#NUM!"}},{"$f":"IFERROR((VLOOKUP(CONCATENATE(B21,C21),Qui!$D$301:$F$356,3,)),0)","v":0},17,null,null,0,{"$f":"IFERROR((VLOOKUP(CONCATENATE(P21,Q21),Qui!$D$301:$F$356,3,0)),0)","v":0}]
[18,{"$nulls":11},{"$f":"SUM(D22:L22*(D22:L22>=LARGE(D22:L22,Qui!$A$402)))","v":{"$error":"#NUM!"}},{"$f":"IFERROR((VLOOKUP(CONCATENATE(B22,C22),Qui!$D$301:$F$356,3,)),0)","v":0},18,null,null,0,{"$f":"IFERROR((VLOOKUP(CONCATENATE(P22,Q22),Qui!$D$301:$F$356,3,0)),0)","v":0}]
[19,{"$nulls":11},{"$f":"SUM(D23:L23*(D23:L23>=LARGE(D23:L23,Qui!$A$402)))","v":{"$error":"#NUM!"}},{"$f":"IFERROR((VLOOKUP(CONCATENATE(B23,C23),Qui!$D$301:$F$356,3,)),0)","v":0},19,null,null,0,{"$f":"IFERROR((VLOOKUP(CONCATENATE(P23,Q23),Qui!$D$301:$F$356,3,0)),0)","v":0}]
[20,{"$nulls":11},{"$f":"SUM(D24:L24*(D24:L24>=LARGE(D24:L24,Qui!$A$402)))","v":{"$error":"#NUM!"}},{"$f":"IFERROR((VLOOKUP(CONCATENATE(B24,C24),Qui!$D$301:$F$356,3,)),0)","v":0},20,null,null,0,{"$f":"IFERROR((VLOOKUP(CONCATENATE(P24,Q24),Qui!$D$301:$F$356,3,0)),0)","v":0}]
[21,{"$nulls":11},{"$f":"SUM(D25:L25*(D25:L25>=LARGE(D25:L25,Qui!$A$402)))","v":{"$error":"#NUM!"}},{"$f":"IFERROR((VLOOKUP(CONCATENATE(B25,C25),Qui!$D$301:$F$356,3,)),0)","v":0},21,null,null,0,{"$f":"IFERROR((VLOOKUP(CONCATENATE(P25,Q25),Qui!$D$301:$F$356,3,0)),0)","v":0}]
[22,{"$nulls":11},{"$f":"SUM(D26:L26*(D26:L26>=LARGE(D26:L26,Qui!$A$402)))","v":{"$error":"#NUM!"}},{"$f":"IFERROR((VLOOKUP(CONCATENATE(B26,C26),Qui!$D$301:$F$356,3,)),0)","v":0},22,null,null,0,{"$f":"IFERROR((VLOOKUP(CONCATENATE(P26,Q26),Qui!$D$301:$F$356,3,0)),0)","v":0}]
[23,{"$nulls":11},{"$f":"SUM(D27:L27*(D27:L27>=LARGE(D27:L27,Qui!$A$402)))","v":{"$error":"#NUM!"}},{"$f":"IFERROR((VLOOKUP(CONCATENATE(B27,C27),Qui!$D$301:$F$356,3,)),0)","v":0},23,null,null,0,{"$f":"IFERROR((VLOOKUP(CONCATENATE(P27,Q27),Qui!$D$301:$F$356,3,0)),0)","v":0}]
[24,{"$nulls":11},{"$f":"SUM(D28:L28*(D28:L28>=LARGE(D28:L28,Qui!$A$402)))","v":{"$error":"#NUM!"}},{"$f":"IFERROR((VLOOKUP(CONCATENATE(B28,C28),Qui!$D$301:$F$356,3,)),0)","v":0},24,null,null,0,{"$f":"IFERROR((VLOOKUP(CONCATENATE(P28,Q28),Qui!$D$301:$F$356,3,0)),0)","v":0}]
[25,{"$nulls":11},{"$f":"SUM(D29:L29*(D29:L29>=LARGE(D29:L29,Qui!$A$402)))","v":{"$error":"#NUM!"}},{"$f":"IFERROR((VLOOKUP(CONCATENATE(B29,C29),Qui!$D$301:$F$356,3,)),0)","v":0},25,null,null,0,{"$f":"IFERROR((VLOOKUP(CONCATENATE(P29,Q29),Qui!$D$301:$F$356,3,0)),0)","v":0}]
[26,{"$nulls":11},{"$f":"SUM(D30:L30*(D30:L30>=LARGE(D30:L30,Qui!$A$402)))","v":{"$error":"#NUM!"}},{"$f":"IFERROR((VLOOKUP(CONCATENATE(B30,C30),Qui!$D$301:$F$356,3,)),0)","v":0},26,null,null,0,{"$f":"IFERROR((VLOOKUP(CONCATENATE(P30,Q30),Qui!$D$301:$F$356,3,0)),0)","v":0}]
[27,{"$nulls":11},{"$f":"SUM(D31:L31*(D31:L31>=LARGE(D31:L31,Qui!$A$402)))","v":{"$error":"#NUM!"}},{"$f":"IFERROR((VLOOKUP(CONCATENATE(B31,C31),Qui!$D$301:$F$356,3,)),0)","v":0},27,null,null,0,{"$f":"IFERROR((VLOOKUP(CONCATENATE(P31,Q31),Qui!$D$301:$F$356,3,0)),0)","v":0}]
[28,{"$nulls":11},{"$f":"SUM(D32:L32*(D32:L32>=LARGE(D32:L32,Qui!$A$402)))","v":{"$error":"#NUM!"}},{"$f":"IFERROR((VLOOKUP(CONCATENATE(B32,C32),Qui!$D$301:$F$356,3,)),0)","v":0},28,null,null,0,{"$f":"IFERROR((VLOOKUP(CONCATENATE(P32,Q32),Qui!$D$301:$F$356,3,0)),0)","v":0}]
[29,{"$nulls":11},{"$f":"SUM(D33:L33*(D33:L33>=LARGE(D33:L33,Qui!$A$402)))","v":{"$error":"#NUM!"}},{"$f":"IFERROR((VLOOKUP(CONCATENATE(B33,C33),Qui!$D$301:$F$356,3,)),0)","v":0},29,null,null,0,{"$f":"IFERROR((VLOOKUP(CONCATENATE(P33,Q33),Qui!$D$301:$F$356,3,0)),0)","v":0}]
[30,{"$nulls":11},{"$f":"SUM(D34:L34*(D34:L34>=LARGE(D34:L34,Qui!$A$402)))","v":{"$error":"#NUM!"}},{"$f":"IFERROR((VLOOKUP(CONCATENATE(B34,C34),Qui!$D$301:$F$356,3,)),0)","v":0},30,null,null,0,{"$f":"IFERROR((VLOOKUP(CONCATENATE(P34,Q34),Qui!$D$301:$F$356,3,0)),0)","v":0}]
[31,{"$nulls":11},{"$f":"SUM(D35:L35*(D35:L35>=LARGE(D35:L35,Qui!$A$402)))","v":{"$error":"#NUM!"}},{"$f":"IFERROR((VLOOKUP(CONCATENATE(B35,C35),Qui!$D$301:$F$356,3,)),0)","v":0},31,null,null,0,{"$f":"IFERROR((VLOOKUP(CONCATENATE(P35,Q35),Qui!$D$301:$F$356,3,0)),0)","v":0}]
[32,{"$nulls":11},{"$f":"SUM(D36:L36*(D36:L36>=LARGE(D36:L36,Qui!$A$402)))","v":{"$error":"#NUM!"}},{"$f":"IFERROR((VLOOKUP(CONCATENATE(B36,C36),Qui!$D$301:$F$356,3,)),0)","v":0},32,null,null,0,{"$f":"IFERROR((VLOOKUP(CONCATENATE(P36,Q36),Qui!$D$301:$F$356,3,0)),0)","v":0}]
[33,{"$nulls":11},{"$f":"SUM(D37:L37*(D37:L37>=LARGE(D37:L37,Qui!$A$402)))","v":{"$error":"#NUM!"}},{"$f":"IFERROR((VLOOKUP(CONCATENATE(B37,C37),Qui!$D$301:$F$356,3,)),0)","v":0},33,null,null,0,{"$f":"IFERROR((VLOOKUP(CONCATENATE(P37,Q37),Qui!$D$301:$F$356,3,0)),0)","v":0}]
[34,{"$nulls":11},{"$f":"SUM(D38:L38*(D38:L38>=LARGE(D38:L38,Qui!$A$402)))","v":{"$error":"#NUM!"}},{"$f":"IFERROR((VLOOKUP(CONCATENATE(B38,C38),Qui!$D$301:$F$356,3,)),0)","v":0},34,null,null,0,{"$f":"IFERROR((VLOOKUP(CONCATENATE(P38,Q38),Qui!$D$301:$F$356,3,0)),0)","v":0}]
[35,{"$nulls":11},{"$f":"SUM(D39:L39*(D39:L39>=LARGE(D39:L39,Qui!$A$402)))","v":{"$error":"#NUM!"}},{"$f":"IFERROR((VLOOKUP(CONCATENATE(B39,C39),Qui!$D$301:$F$356,3,)),0)","v":0},35,null,null,0,{"$f":"IFERROR((VLOOKUP(CONCATENATE(P39,Q39),Qui!$D$301:$F$356,3,0)),0)","v":0}]
[36,null,null,0,0,0,0,0,0,0,0,0,{"$f":"SUM(D40:L40*(D40:L40>=LARGE(D40:L40,Qui!$A$402)))","v":0},{"$f":"IFERROR((VLOOKUP(CONCATENATE(B40,C40),Qui!$D$301:$F$356,3,)),0)","v":0},36,null,null,0,{"$f":"IFERROR((VLOOKUP(CONCATENATE(P40,Q40),Qui!$D$301:$F$356,3,0)),0)","v":0}]
[37,null,null,0,0,0,0,0,0,0,0,0,{"$f":"SUM(D41:L41*(D41:L41>=LARGE(D41:L41,Qui!$A$402)))","v":0},{"$f":"IFERROR((VLOOKUP(CONCATENATE(B41,C41),Qui!$D$301:$F$356,3,)),0)","v":0},37,null,null,0,{"$f":"IFERROR((VLOOKUP(CONCATENATE(P41,Q41),Qui!$D$301:$F$356,3,0)),0)","v":0}]
[38,null,null,0,0,0,0,0,0,0,0,0,{"$f":"SUM(D42:L42*(D42:L42>=LARGE(D42:L42,Qui!$A$402)))","v":0},{"$f":"IFERROR((VLOOKUP(CONCATENATE(B42,C42),Qui!$D$301:$F$356,3,)),0)","v":0},38,null,null,0,{"$f":"IFERROR((VLOOKUP(CONCATENATE(P42,Q42),Qui!$D$301:$F$356,3,0)),0)","v":0}]
[39,null,null,0,0,0,0,0,0,0,0,0,{"$f":"SUM(D43:L43*(D43:L43>=LARGE(D43:L43,Qui!$A$402)))","v":0},{"$f":"IFERROR((VLOOKUP(CONCATENATE(B43,C43),Qui!$D$301:$F$356,3,)),0)","v":0},39,null,null,0,{"$f":"IFERROR((VLOOKUP(CONCATENATE(P43,Q43),Qui!$D$301:$F$356,3,0)),0)","v":0}]
[40,null,null,0,0,0,0,0,0,0,0,0,{"$f":"SUM(D44:L44*(D44:L44>=LARGE(D44:L44,Qui!$A$402)))","v":0},{"$f":"IFERROR((VLOOKUP(CONCATENATE(B44,C44),Qui!$D$301:$F$356,3,)),0)","v":0},40,null,null,0,{"$f":"IFERROR((VLOOKUP(CONCATENATE(P44,Q44),Qui!$D$301:$F$356,3,0)),0)","v":0}]
[41,null,null,0,0,0,0,0,0,0,0,0,{"$f":"SUM(D45:L45*(D45:L45>=LARGE(D45:L45,Qui!$A$402)))","v":0},{"$f":"IFERROR((VLOOKUP(CONCATENATE(B45,C45),Qui!$D$301:$F$356,3,)),0)","v":0},41,null,null,0,{"$f":"IFERROR((VLOOKUP(CONCATENATE(P45,Q45),Qui!$D$301:$F$356,3,0)),0)","v":0}]
[42,null,null,0,0,0,0,0,0,0,0,0,{"$f":"SUM(D46:L46*(D46:L46>=LARGE(D46:L46,Qui!$A$402)))","v":0},{"$f":"IFERROR((VLOOKUP(CONCATENATE(B46,C46),Qui!$D$301:$F$356,3,)),0)","v":0},42,null,null,0,{"$f":"IFERROR((VLOOKUP(CONCATENATE(P46,Q46),Qui!$D$301:$F$356,3,0)),0)","v":0}]
[43,null,null,0,0,0,0,0,0,0,0,0,{"$f":"SUM(D47:L47*(D47:L47>=LARGE(D47:L47,Qui!$A$402)))","v":0},{"$f":"IFERROR((VLOOKUP(CONCATENATE(B47,C47),Qui!$D$301:$F$356,3,)),0)","v":0},43,null,null,0,{"$f":"IFERROR((VLOOKUP(CONCATENATE(P47,Q47),Qui!$D$301:$F$356,3,0)),0)","v":0}]
[44,null,null,0,0,0,0,0,0,0,0,0,{"$f":"SUM(D48:L48*(D48:L48>=LARGE(D48:L48,Qui!$A$402)))","v":0},{"$f":"IFERROR((VLOOKUP(CONCATENATE(B48,C48),Qui!$D$301:$F$356,3,)),0)","v":0},44,null,null,0,{"$f":"IFERROR((VLOOKUP(CONCATENATE(P48,Q48),Qui!$D$301:$F$356,3,0)),0)","v":0}]
[45,null,null,0,0,0,0,0,0,0,0,0,{"$f":"SUM(D49:L49*(D49:L49>=LARGE(D49:L49,Qui!$A$402)))","v":0},{"$f":"IFERROR((VLOOKUP(CONCATENATE(B49,C49),Qui!$D$301:$F$356,3,)),0)","v":0},45,null,null,0,{"$f":"IFERROR((VLOOKUP(CONCATENATE(P49,Q49),Qui!$D$301:$F$356,3,0)),0)","v":0}]
[46,null,null,0,0,0,0,0,0,0,0,0,{"$f":"SUM(D50:L50*(D50:L50>=LARGE(D50:L50,Qui!$A$402)))","v":0},{"$f":"IFERROR((VLOOKUP(CONCATENATE(B50,C50),Qui!$D$301:$F$356,3,)),0)","v":0},46,null,null,0,{"$f":"IFERROR((VLOOKUP(CONCATENATE(P50,Q50),Qui!$D$301:$F$356,3,0)),0)","v":0}]
[47,null,null,0,0,0,0,0,0,0,0,0,{"$f":"SUM(D51:L51*(D51:L51>=LARGE(D51:L51,Qui!$A$402)))","v":0},{"$f":"IFERROR((VLOOKUP(CONCATENATE(B51,C51),Qui!$D$301:$F$356,3,)),0)","v":0},47,null,null,0,{"$f":"IFERROR((VLOOKUP(CONCATENATE(P51,Q51),Qui!$D$301:$F$356,3,0)),0)","v":0}]
[48,null,null,0,0,0,0,0,0,0,0,0,{"$f":"SUM(D52:L52*(D52:L52>=LARGE(D52:L52,Qui!$A$402)))","v":0},{"$f":"IFERROR((VLOOKUP(CONCATENATE(B52,C52),Qui!$D$301:$F$356,3,)),0)","v":0},48,null,null,0,{"$f":"IFERROR((VLOOKUP(CONCATENATE(P52,Q52),Qui!$D$301:$F$356,3,0)),0)","v":0}]
[49,null,null,0,0,0,0,0,0,0,0,0,{"$f":"SUM(D53:L53*(D53:L53>=LARGE(D53:L53,Qui!$A$402)))","v":0},{"$f":"IFERROR((VLOOKUP(CONCATENATE(B53,C53),Qui!$D$301:$F$356,3,)),0)","v":0},49,null,null,0,{"$f":"IFERROR((VLOOKUP(CONCATENATE(P53,Q53),Qui!$D$301:$F$356,3,0)),0)","v":0}]
[50,null,null,0,0,0,0,0,0,0,0,0,{"$f":"SUM(D54:L54*(D54:L54>=LARGE(D54:L54,Qui!$A$402)))","v":0},{"$f":"IFERROR((VLOOKUP(CONCATENATE(B54,C54),Qui!$D$301:$F$356,3,)),0)","v":0},50,null,null,0,{"$f":"IFERROR((VLOOKUP(CONCATENATE(P54,Q54),Qui!$D$301:$F$356,3,0)),0)","v":0}]
[51,null,null,0,0,0,0,0,0,0,0,0,{"$f":"SUM(D55:L55*(D55:L55>=LARGE(D55:L55,Qui!$A$402)))","v":0},{"$f":"IFERROR((VLOOKUP(CONCATENATE(B55,C55),Qui!$D$301:$F$356,3,)),0)","v":0},51,null,null,0,{"$f":"IFERROR((VLOOKUP(CONCATENATE(P55,Q55),Qui!$D$301:$F$356,3,0)),0)","v":0}]
[52,null,null,0,0,0,0,0,0,0,0,0,{"$f":"SUM(D56:L56*(D56:L56>=LARGE(D56:L56,Qui!$A$402)))","v":0},{"$f":"IFERROR((VLOOKUP(CONCATENATE(B56,C56),Qui!$D$301:$F$356,3,)),0)","v":0},52,null,null,0,{"$f":"IFERROR((VLOOKUP(CONCATENATE(P56,Q56),Qui!$D$301:$F$356,3,0)),0)","v":0}]
[53,{"$nulls":3},0,0,0,0,0,0,0,0,{"$f":"SUM(D57:L57*(D57:L57>=LARGE(D57:L57,Qui!$A$402)))","v":0},{"$f":"IFERROR((VLOOKUP(CONCATENATE(B57,C57),Qui!$D$301:$F$356,3,)),0)","v":0},53,null,null,0,{"$f":"IFERROR((VLOOKUP(CONCATENATE(P57,Q57),Qui!$D$301:$F$356,3,0)),0)","v":0}]
[54,{"$nulls":3},0,0,0,0,0,0,0,0,{"$f":"SUM(D58:L58*(D58:L58>=LARGE(D58:L58,Qui!$A$402)))","v":0},{"$f":"IFERROR((VLOOKUP(CONCATENATE(B58,C58),Qui!$D$301:$F$356,3,)),0)","v":0},54,null,null,0,{"$f":"IFERROR((VLOOKUP(CONCATENATE(P58,Q58),Qui!$D$301:$F$356,3,0)),0)","v":0}]
[{"$nulls":3},{"$f":"MAX(D5:D58)","v":0},null,{"$f":"MAX(F5:F58)","v":0},{"$f":"MAX(G5:G58)","v":0},null,{"$f":"MAX(I5:I58)","v":0},{"$f":"MAX(J5:J58)","v":0},{"$f":"MAX(K5:K58)","v":0},{"$f":"MAX(L5:L58)","v":0}]
["Classement général par équipe",{"$nulls":13},"Classement par équipe"]
[]
[1,{"$nulls":8},{"v":418.04,"d":"418"},null,null,{"$f":"SUM(D62:L62*(D62:L62>=LARGE(D62:L62,Qui!$B$402)))","v":{"$error":"#NUM!"}},{"$f":"VLOOKUP(B62,Qui!$A$201:$D$204,4)","v":{"$error":"#N/A"}},1,null,null,0,{"$f":"VLOOKUP(P62,Qui!$A$201:$D$204,4)","v":{"$error":"#N/A"}}]
[2,{"$nulls":8},{"v":444.03,"d":"444"},null,null,{"$f":"SUM(D63:L63*(D63:L63>=LARGE(D63:L63,Qui!$B$402)))","v":{"$error":"#NUM!"}},{"$f":"VLOOKUP(B63,Qui!$A$201:$D$204,4)","v":{"$error":"#N/A"}},2,null,null,0,{"$f":"VLOOKUP(P63,Qui!$A$201:$D$204,4)","v":{"$error":"#N/A"}}]
[3,{"$nulls":8},412,null,null,{"$f":"SUM(D64:L64*(D64:L64>=LARGE(D64:L64,Qui!$B$402)))","v":{"$error":"#NUM!"}},{"$f":"VLOOKUP(B64,Qui!$A$201:$D$204,4)","v":{"$error":"#N/A"}},3,null,null,0,{"$f":"VLOOKUP(P64,Qui!$A$201:$D$204,4)","v":{"$error":"#N/A"}}]
[4,{"$nulls":8},{"v":426.11,"d":"426"},null,null,{"$f":"SUM(D65:L65*(D65:L65>=LARGE(D65:L65,Qui!$B$402)))","v":{"$error":"#NUM!"}},{"$f":"VLOOKUP(B65,Qui!$A$201:$D$204,4)","v":{"$error":"#N/A"}},4,null,null,0,{"$f":"VLOOKUP(P65,Qui!$A$201:$D$204,4)","v":{"$error":"#N/A"}}]
[5,{"$nulls":3},435,{"$error":"#N/A"},{"$error":"#N/A"},{"$error":"#N/A"},null,{"$error":"#N/A"},null,null,{"$f":"SUM(D66:L66*(D66:L66>=LARGE(D66:L66,Qui!$B$402)))","v":{"$error":"#N/A"}},{"$f":"VLOOKUP(B66,Qui!$A$201:$D$204,4)","v":{"$error":"#N/A"}},5,null,null,{"$f":"SUMPRODUCT(((($S$5:$S$58=S66)*$R$5:$R$58*1))*((($S$5:$S$58=S66)*$R$5:$R$58*1)>=LARGE((($S$5:$S$58=S66)*$R$5:$R$58*1),Qui!$B$402)))","v":{"$error":"#N/A"}},{"$f":"VLOOKUP(P66,Qui!$A$201:$D$204,4)","v":{"$error":"#N/A"}}]
[6,{"$nulls":3},435,{"$error":"#N/A"},{"$error":"#N/A"},{"$error":"#N/A"},null,{"$error":"#N/A"},null,null,{"$f":"SUM(D67:L67*(D67:L67>=LARGE(D67:L67,Qui!$B$402)))","v":{"$error":"#N/A"}},{"$f":"VLOOKUP(B67,Qui!$A$201:$D$204,4)","v":{"$error":"#N/A"}},6,null,null,{"$f":"SUMPRODUCT(((($S$5:$S$58=S67)*$R$5:$R$58*1))*((($S$5:$S$58=S67)*$R$5:$R$58*1)>=LARGE((($S$5:$S$58=S67)*$R$5:$R$58*1),Qui!$B$402)))","v":{"$error":"#N/A"}},{"$f":"VLOOKUP(P67,Qui!$A$201:$D$204,4)","v":{"$error":"#N/A"}}]
[{"$nulls":3},{"$f":"MAX(D62:D67)","v":0},null,{"$f":"MAX(F62:F67)","v":{"$error":"#N/A"}},{"$f":"MAX(G62:G67)","v":{"$error":"#N/A"}},null,{"$f":"MAX(I62:I67)","v":0},{"$f":"MAX(J62:J67)","v":{"$error":"#N/A"}},{"$f":"MAX(K62:K67)","v":0},{"$f":"MAX(L62:L67)","v":0},{"$nulls":5},0]
[{"$nulls":12},"La Chaux-de-Fonds, le 4 décembre 2019, CM / DP"]
[]
[null,{"$f":"CONCATENATE(\"Rappels :\")","v":"Rappels :"}]
[]
[null,{"$f":"CONCATENATE(\"a) le classement général par équipe  est fait sur le cumul des \",Qui!$B$402,\" meilleurs résultats individuels de chaque manche\")","v":"a) le classement général par équipe  est fait sur le cumul des 5 meilleurs résultats individuels de chaque manche"}]
[null,{"$f":"CONCATENATE(\"b) le classement général individuel est fait sur le cumul des \",Qui!$A$402,\" meilleurs résultats individuels\")","v":"b) le classement général individuel est fait sur le cumul des 5 meilleurs résultats individuels"}]

{"sheet":"Challenge_1","index":10,"n_rows":59,"n_cols":27,"rows_kept":59,"hidden":true,"merged":[[0,0,0,9],[1,0,1,9],[3,16,3,18],[3,21,3,26],[56,7,56,8]]}
["Association intercantonale\n des joueurs de boules,\nGrand Jeu Neuchâtelois\n"]
[{"$f":"CONCATENATE(Calendrier!A4,\"      Jeu : \",(Calendrier!F4))","v":"Challenge 80ème      Jeu : L'Epi"}]
[{"$nulls":9},{"$f":"CONCATENATE(\"du \",TEXT(Calendrier!F6,\" jj.mm\"),\" au \",TEXT(Calendrier!F9,\" jj.mm.aaaa\"))","v":"du  18.03 au  21.03.2024"}]
["Classement par équipes",{"$nulls":6},"Classement individuel",{"$nulls":4},"Equipe",{"$nulls":3},"Equipes possibles",{"$nulls":4},"Equipes triées"]
[{"$nulls":16},"N°","Nom","Total équipe",null,null,"Rang","Nom","Prénom","Résultat","TotEquipe","Equipe"]
["1er",{"$f":"IF($D11,(INDEX($Q$6:$S$20,MATCH($AA6,$Q$6:$Q$20,0),2)),0)","v":"L'Epi I"},null,null,{"$f":"VLOOKUP(B6,Qui!$A$201:$D$204,4)","v":4},1,null,"Reichen","Sylvain",115,{"$f":"IFERROR((VLOOKUP(CONCATENATE(H6,I6),Qui!$D$301:$F$356,3,0)),0)","v":4},null,"E1",{"$nulls":3},"C1","La Chaux-de-Fonds  I",{"$f":"SUMIF($M$6:$M$40,\"=\"&$Q6,$J$6:$J$40)","v":300},null,null,1,"Reichen","Sylvain",115,{"$f":"IF($AA6<>\"\",(IF($Y6,(INDEX($Q$6:$S$20,MATCH($AA6,$Q$6:$Q$20,0),3)),0)),0)","v":414},"E1"]
[null,{"$f":"W6","v":"Reichen"},"Sylvain",115,null,2,null,"Bühler","Raymond",113,{"$f":"IFERROR((VLOOKUP(CONCATENATE(H7,I7),Qui!$D$301:$F$356,3,0)),0)","v":0},null,"E1",{"$nulls":3},"C2","La Chaux-de-Fonds  II",134,null,null,2,"Bühler","Raymond",113,414,"E1"]
[null,"Bühler","Raymond",113,null,3,null,"Gerber","Michel",111,{"$f":"IFERROR((VLOOKUP(CONCATENATE(H8,I8),Qui!$D$301:$F$356,3,0)),0)","v":0},null,"L1",{"$nulls":3},"E1","L'Epi I",414,null,null,3,"Mores","Blaise",94,414,"E1"]
[null,"Mores","Blaise",94,null,4,null,"Tynowski","Lucien",103,{"$f":"IFERROR((VLOOKUP(CONCATENATE(H9,I9),Qui!$D$301:$F$356,3,0)),0)","v":3},null,"L1",{"$nulls":3},"E2","L'Epi II",192,null,null,4,"Wäfler","Jean-Louis",92,414,"E1"]
[null,"Wäfler","Jean-Louis",92,null,5,null,"Cassi","Alain",96,{"$f":"IFERROR((VLOOKUP(CONCATENATE(H10,I10),Qui!$D$301:$F$356,3,0)),0)","v":3},null,"L1",{"$nulls":3},"L1","Le Locle I",400,null,null,5,"Gerber","Michel",111,400,"L1"]
[null,null,"Total",{"$f":"SUM(D7:D10)","v":414},null,6,null,"Dick","Pierre-Alain",95,{"$f":"IFERROR((VLOOKUP(CONCATENATE(H11,I11),Qui!$D$301:$F$356,3,0)),0)","v":2},null,"V1",{"$nulls":3},"L2","Le Locle II",0,null,null,6,"Tynowski","Lucien",103,400,"L1"]
[{"$nulls":5},7,null,"Mores","Blaise",94,{"$f":"IFERROR((VLOOKUP(CONCATENATE(H12,I12),Qui!$D$301:$F$356,3,0)),0)","v":4},null,"E1",{"$nulls":3},"V1","La Vue-des-Alpes I",286.1,null,null,7,"Cassi","Alain",96,400,"L1"]
["2ème",{"$f":"IF($D18,(INDEX($Q$6:$S$20,MATCH($AA10,$Q$6:$Q$20,0),2)),0)","v":"Le Locle I"},null,null,{"$f":"VLOOKUP(B13,Qui!$A$201:$D$204,4)","v":3},8,null,"Wäfler","Jean-Louis",92,{"$f":"IFERROR((VLOOKUP(CONCATENATE(H13,I13),Qui!$D$301:$F$356,3,0)),0)","v":4},null,"E1",{"$nulls":3},"V2","La Vue-des-Alpes II",0,null,null,8,"Bart","Fabien",90,400,"L1"]
[null,{"$f":"W10","v":"Gerber"},"Michel",111,null,9,null,"Bart","Fabien",90,{"$f":"IFERROR((VLOOKUP(CONCATENATE(H14,I14),Qui!$D$301:$F$356,3,0)),0)","v":3},null,"L1",{"$nulls":5},201,null,null,9,"Billod-Morel","Gérald",82,300,"C1"]
[null,"Tynowski","Lucien",103,null,10,null,"Jeanneret","Louis",82,{"$f":"IFERROR((VLOOKUP(CONCATENATE(H15,I15),Qui!$D$301:$F$356,3,0)),0)","v":2},null,"V1",{"$nulls":5},201,null,null,10,"Voirol","Pierre",81,300,"C1"]
[null,"Cassi","Alain",96,null,11,null,"Billod-Morel","Gérald",82,{"$f":"IFERROR((VLOOKUP(CONCATENATE(H16,I16),Qui!$D$301:$F$356,3,0)),0)","v":1},null,"C1",{"$nulls":5},201,null,null,11,"Rollat","Christian",76,300,"C1"]
[null,"Bart","Fabien",90,null,12,null,"Voirol","Pierre",81,{"$f":"IFERROR((VLOOKUP(CONCATENATE(H17,I17),Qui!$D$301:$F$356,3,0)),0)","v":1},null,"C1",{"$nulls":5},201,null,null,12,"Monnier","Christian",61,300,"C1"]
[null,null,"Total",{"$f":"SUM(D14:D17)","v":400},null,13,null,"Pellaton","Daniel",80,{"$f":"IFERROR((VLOOKUP(CONCATENATE(H18,I18),Qui!$D$301:$F$356,3,0)),0)","v":4},null,"E2",{"$nulls":5},201,null,null,13,"Dick","Pierre-Alain",95,286.1,"V1"]
[{"$nulls":5},14,null,"Rollat","Christian",76,{"$f":"IFERROR((VLOOKUP(CONCATENATE(H19,I19),Qui!$D$301:$F$356,3,0)),0)","v":1},null,"C1",{"$nulls":5},201,null,null,14,"Jeanneret","Louis",82,286.1,"V1"]
["3ème",{"$f":"IF($D25,(INDEX($Q$6:$S$20,MATCH($AA14,$Q$6:$Q$20,0),2)),0)","v":"La Chaux-de-Fonds  I"},null,null,{"$f":"VLOOKUP(B20,Qui!$A$201:$D$204,4)","v":1},15,null,"Chassot","Yves",76,{"$f":"IFERROR((VLOOKUP(CONCATENATE(H20,I20),Qui!$D$301:$F$356,3,0)),0)","v":2},null,"V1",{"$nulls":5},201,null,null,15,"Chassot","Yves",76,286.1,"V1"]
[null,{"$f":"W14","v":"Billod-Morel"},"Gérald",82,null,16,null,"Rossier","Yves-Alain",69,{"$f":"IFERROR((VLOOKUP(CONCATENATE(H21,I21),Qui!$D$301:$F$356,3,0)),0)","v":4},null,"E2",{"$nulls":8},16,"Vuillème","Claude-Alain",33.1,286.1,"V1"]
[null,"Voirol","Pierre",81,null,17,null,"Monnier","Christian",61,{"$f":"IFERROR((VLOOKUP(CONCATENATE(H22,I22),Qui!$D$301:$F$356,3,0)),0)","v":1},null,"C1",{"$nulls":8},17,"Pellaton","Daniel",80,192,"E2"]
[null,"Rollat","Christian",76,null,18,null,"Dubois","Eric",59,{"$f":"IFERROR((VLOOKUP(CONCATENATE(H23,I23),Qui!$D$301:$F$356,3,0)),0)","v":1},null,"C2",{"$nulls":8},18,"Rossier","Yves-Alain",69,192,"E2"]
[null,"Monnier","Christian",61,null,19,null,"Tinguely","Didier",58,{"$f":"IFERROR((VLOOKUP(CONCATENATE(H24,I24),Qui!$D$301:$F$356,3,0)),0)","v":1},{"$nulls":10},19,"Frutiger","Bertrand",33,192,"E2"]
[{"$nulls":3},{"$f":"SUM(D21:D24)","v":300},null,20,null,"Oppliger","Hervé",55,{"$f":"IFERROR((VLOOKUP(CONCATENATE(H25,I25),Qui!$D$301:$F$356,3,0)),0)","v":2},{"$nulls":10},20,"Rindlisbacher","Heinz",10,192,"E2"]
[{"$nulls":5},21,null,"Dubois","Marcel",46,{"$f":"IFERROR((VLOOKUP(CONCATENATE(H26,I26),Qui!$D$301:$F$356,3,0)),0)","v":1},{"$nulls":10},21,"Dubois","Eric",59,134,"C2"]
["4ème",{"$f":"IF($D32,(INDEX($Q$6:$S$20,MATCH($AA18,$Q$6:$Q$20,0),2)),0)","v":"La Vue-des-Alpes I"},null,null,{"$f":"VLOOKUP(B27,Qui!$A$201:$D$204,4)","v":2},22,null,"Haussener","Philippe",42,{"$f":"IFERROR((VLOOKUP(CONCATENATE(H27,I27),Qui!$D$301:$F$356,3,0)),0)","v":2},{"$nulls":10},22,"Dubois","Emmanuel",38,134,"C2"]
[null,{"$f":"W18","v":"Dick"},"Pierre-Alain",95,null,23,null,"Dubois","Emmanuel",38,{"$f":"IFERROR((VLOOKUP(CONCATENATE(H28,I28),Qui!$D$301:$F$356,3,0)),0)","v":1},null,"C2",{"$nulls":8},23,"Matthey","Pierre",24,134,"C2"]
[null,"Jeanneret","Louis",82,null,24,null,"Vuillème","Claude-Alain",{"v":33.1,"d":"33"},{"$f":"IFERROR((VLOOKUP(CONCATENATE(H29,I29),Qui!$D$301:$F$356,3,0)),0)","v":2},null,"V1",{"$nulls":8},24,"Jean-Mairet","Jean-Claude",13,134,"C2"]
[null,"Chassot","Yves",76,null,25,null,"Frutiger","Bertrand",33,{"$f":"IFERROR((VLOOKUP(CONCATENATE(H30,I30),Qui!$D$301:$F$356,3,0)),0)","v":4},null,"E2",{"$nulls":8},25,"Tinguely","Didier",58,0]
[null,"Vuillème","Claude-Alain",{"v":33.1,"d":"33"},null,26,null,"Matthey","Pierre",24,{"$f":"IFERROR((VLOOKUP(CONCATENATE(H31,I31),Qui!$D$301:$F$356,3,0)),0)","v":1},null,"C2",{"$nulls":8},26,"Oppliger","Hervé",55,0]
[null,null,"Total",{"$f":"SUM(D28:D31)","v":{"v":286.1,"d":"286"}},null,27,null,"Jean-Mairet","Jean-Claude",13,{"$f":"IFERROR((VLOOKUP(CONCATENATE(H32,I32),Qui!$D$301:$F$356,3,0)),0)","v":1},null,"C2",{"$nulls":8},27,"Dubois","Marcel",46,0]
[{"$nulls":5},28,null,"Rindlisbacher","Heinz",10,{"$f":"IFERROR((VLOOKUP(CONCATENATE(H33,I33),Qui!$D$301:$F$356,3,0)),0)","v":4},null,"E2",{"$nulls":8},28,"Haussener","Philippe",42,0]
["5ème",{"$f":"IF($D39,(INDEX($Q$6:$S$20,MATCH($AA22,$Q$6:$Q$20,0),2)),0)","v":"L'Epi II"},null,null,{"$f":"VLOOKUP(B34,Qui!$A$201:$D$204,4)","v":4},29,null,"Favre","Daniel",0,{"$f":"IFERROR((VLOOKUP(CONCATENATE(H34,I34),Qui!$D$301:$F$356,3,0)),0)","v":3},{"$nulls":10},29,"Favre","Daniel",0,0]
[null,{"$f":"W22","v":"Pellaton"},"Daniel",80,null,30,null,"Bourquin","Willy",0,{"$f":"IFERROR((VLOOKUP(CONCATENATE(H35,I35),Qui!$D$301:$F$356,3,0)),0)","v":4},{"$nulls":10},30,"Bourquin","Willy",0,0]
[null,"Rossier","Yves-Alain",69,null,31,null,"Charlet","Léon",0,{"$f":"IFERROR((VLOOKUP(CONCATENATE(H36,I36),Qui!$D$301:$F$356,3,0)),0)","v":0},{"$nulls":10},31,"Charlet","Léon",0,0]
[null,"Frutiger","Bertrand",33,null,32,null,"Kemajl","Fetahi",0,{"$f":"IFERROR((VLOOKUP(CONCATENATE(H37,I37),Qui!$D$301:$F$356,3,0)),0)","v":3},{"$nulls":10},32,"Kemajl","Fetahi",0,0]
[null,"Rindlisbacher","Heinz",10,null,33,null,"Geiser","Willy",0,{"$f":"IFERROR((VLOOKUP(CONCATENATE(H38,I38),Qui!$D$301:$F$356,3,0)),0)","v":0},{"$nulls":10},33,"Geiser","Willy",0,{"$f":"IF($AA38<>\"\",(IF($Y38,(INDEX($Q$6:$S$20,MATCH($AA38,$Q$6:$Q$20,0),3)),0)),0)","v":0}]
[null,null,"Total",{"$f":"SUM(D35:D38)","v":192},null,34,{"$nulls":4},{"$f":"IFERROR((VLOOKUP(CONCATENATE(H39,I39),Qui!$D$301:$F$356,3,0)),0)","v":0},{"$nulls":10},34,{"$nulls":3},0]
[{"$nulls":5},35,{"$nulls":4},{"$f":"IFERROR((VLOOKUP(CONCATENATE(H40,I40),Qui!$D$301:$F$356,3,0)),0)","v":0},{"$nulls":10},35,{"$nulls":3},0]
["6ème",{"$f":"IF($D46,(INDEX($Q$6:$S$20,MATCH($AA26,$Q$6:$Q$20,0),2)),0)","v":"La Chaux-de-Fonds  II"},null,null,{"$f":"VLOOKUP(B41,Qui!$A$201:$D$204,4)","v":1},36,{"$nulls":15},36,{"$nulls":3},0]
[null,{"$f":"W26","v":"Dubois"},"Eric",59,null,37,{"$nulls":15},37,{"$nulls":3},0]
[null,"Dubois","Emmanuel",38,null,38,{"$nulls":15},38,{"$nulls":3},0]
[null,"Matthey","Pierre",24,null,39,{"$nulls":15},39,{"$nulls":3},0]
[null,"Jean-Mairet","Jean-Claude",13,null,40,{"$nulls":15},40,{"$nulls":3},0]
[{"$nulls":3},{"$f":"SUM(D42:D45)","v":134},null,41,{"$nulls":15},41,{"$nulls":3},0]
[{"$nulls":5},42,{"$nulls":15},42,{"$nulls":3},0]
["7ème",{"$f":"IF($D53,(INDEX($Q$6:$S$20,MATCH($AA30,$Q$6:$Q$20,0),2)),0)","v":{"$error":"#N/A"}},null,null,{"$f":"VLOOKUP(B48,Qui!$A$201:$D$204,4)","v":{"$error":"#N/A"}},43,{"$nulls":15},43,{"$nulls":3},0]
[null,{"$f":"W30","v":"Tinguely"},"Didier",58,{"$f":"Z33","v":0},44,{"$nulls":15},44,{"$nulls":3},0]
[null,"Oppliger","Hervé",55,null,45,{"$nulls":15},45,{"$nulls":3},0]
[null,"Dubois","Marcel",46,null,46,{"$nulls":15},46,{"$nulls":3},0]
[null,"Haussener","Philippe",42,null,47,{"$nulls":15},47,{"$nulls":3},0]
[{"$nulls":3},{"$f":"SUM(D49:D52)","v":201},null,48,{"$nulls":15},48,{"$nulls":3},0]
["8ème",{"$f":"IF($D59,(INDEX($Q$6:$S$20,MATCH($AA34,$Q$6:$Q$20,0),2)),0)","v":0},null,null,{"$f":"VLOOKUP(B54,Qui!$A$201:$D$204,4)","v":{"$error":"#N/A"}},49,{"$nulls":15},49,{"$nulls":3},0]
[null,{"$f":"W34","v":"Favre"},"Daniel",0]
[null,"Bourquin","Willy",0]
[null,"Charlet","Léon",0,{"$nulls":3},{"$f":"CONCATENATE(\"Champion de jeu : \",H6,\" \",I6)","v":"Champion de jeu : Reichen Sylvain"},null,{"$f":"J6","v":115}]
[null,"Kemajl","Fetahi",0]
[{"$nulls":3},{"$f":"SUM(D55:D58)","v":0},{"$nulls":5},"La Chaux-de-Fonds, le 4 avril 2020, cm"]

{"sheet":"Challenge_2","index":11,"n_rows":59,"n_cols":27,"rows_kept":59,"hidden":true,"merged":[[0,0,0,9],[1,0,1,9],[3,16,3,18],[3,21,3,26],[4,1,4,2],[56,7,56,8]]}
["Association intercantonale\n des joueurs de boules,\nGrand Jeu Neuchâtelois\n"]
[{"$f":"CONCATENATE(Calendrier!A25,\"      Jeu : \",(Calendrier!F25))","v":"Challenge -  ÉTÉ (ex Impartial)      Jeu : "}]
[{"$nulls":9},{"$f":"CONCATENATE(\"du \",TEXT(Calendrier!F27,\" jj.mm\"),\" au \",TEXT(Calendrier!F30,\" jj.mm.aaaa\"))","v":"du  08.05 au  11.05.2023"}]
["Classement par équipe",{"$nulls":6},"Classement individuel",{"$nulls":4},"Equipe",{"$nulls":3},"Equipes possibles",{"$nulls":4},"Equipes triées"]
[{"$nulls":16},"N°","Nom","Total équipe",null,null,"Rang","Nom","Prénom","Résultat","TotEquipe","Equipe"]
[1,"La Chaux-de-Fonds",null,471,{"$f":"VLOOKUP(B6,Qui!$A$201:$D$204,4)","v":1},1,null,"Tynowski","Lucien",121,{"$f":"IFERROR((VLOOKUP(CONCATENATE(H6,I6),Qui!$D$301:$F$356,3,0)),0)","v":3},{"$nulls":5},"C1","La Chaux-de-Fonds  I",{"$f":"SUMIF($M$6:$M$40,\"=\"&$Q6,$J$6:$J$40)","v":0},null,null,1,"Mores","Blaise",103,{"$f":"IF($AA6<>\"\",(IF($Y6,(INDEX($Q$6:$S$20,MATCH($AA6,$Q$6:$Q$20,0),3)),0)),0)","v":0}]
[2,"Le Locle",null,468,null,2,null,"Favre","Daniel",111,{"$f":"IFERROR((VLOOKUP(CONCATENATE(H7,I7),Qui!$D$301:$F$356,3,0)),0)","v":3},{"$nulls":5},"C2","La Chaux-de-Fonds  II",0,null,null,2,"Tynowski","Lucien",101,0]
[3,"L'Epi",null,416,null,3,null,"Monnier","Christian",109,{"$f":"IFERROR((VLOOKUP(CONCATENATE(H8,I8),Qui!$D$301:$F$356,3,0)),0)","v":1},{"$nulls":5},"E1","L'Epi I",0,null,null,3,"Favre","Daniel",100,0]
[4,"La Vue-des-Alpes",null,412,null,4,null,"Bart","Fabien",106,{"$f":"IFERROR((VLOOKUP(CONCATENATE(H9,I9),Qui!$D$301:$F$356,3,0)),0)","v":3},{"$nulls":5},"E2","L'Epi II",0,null,null,4,"Monnier","Christian",99,0]
[{"$nulls":5},5,null,"Voirol","Pierre",105,{"$f":"IFERROR((VLOOKUP(CONCATENATE(H10,I10),Qui!$D$301:$F$356,3,0)),0)","v":1},{"$nulls":5},"L1","Le Locle I",0,null,null,5,"Bart","Fabien ",93,0]
[{"$nulls":5},6,null,"Mores","Blaise",103,{"$f":"IFERROR((VLOOKUP(CONCATENATE(H11,I11),Qui!$D$301:$F$356,3,0)),0)","v":4},{"$nulls":5},"L2","Le Locle II",0,null,null,6,"Fetahi","Kemajl",92,0]
[{"$nulls":5},7,null,"Billod-Morel","Gérald",99,{"$f":"IFERROR((VLOOKUP(CONCATENATE(H12,I12),Qui!$D$301:$F$356,3,0)),0)","v":1},{"$nulls":5},"V1","La Vue-des-Alpes I",0,null,null,7,"Bourquin","Willy",80,0]
[{"$nulls":4},{"$f":"VLOOKUP(B13,Qui!$A$201:$D$204,4)","v":{"$error":"#N/A"}},8,null,"Dubois","Eric",92,{"$f":"IFERROR((VLOOKUP(CONCATENATE(H13,I13),Qui!$D$301:$F$356,3,0)),0)","v":1},{"$nulls":5},"V2","La Vue-des-Alpes II",0,null,null,8,"Cassi","Alain",78,0]
[{"$nulls":5},9,null,"Frutiger","Bertrand",92,{"$f":"IFERROR((VLOOKUP(CONCATENATE(H14,I14),Qui!$D$301:$F$356,3,0)),0)","v":4},{"$nulls":7},2110,null,null,9,"Dick","Pierre-Alain",75,0]
[{"$nulls":5},10,null,"Fetahi","Kemajl",89,{"$f":"IFERROR((VLOOKUP(CONCATENATE(H15,I15),Qui!$D$301:$F$356,3,0)),0)","v":0},{"$nulls":7},2110,null,null,10,"Jeanneret ","Louis",72,0]
[{"$nulls":5},11,null,"Chassot","Yves-Alain",87,{"$f":"IFERROR((VLOOKUP(CONCATENATE(H16,I16),Qui!$D$301:$F$356,3,0)),0)","v":0},{"$nulls":7},2110,null,null,11,"Frutiger","Bertrand",69,0]
[{"$nulls":5},12,null,"Vuillème","Claude-Alain",85,{"$f":"IFERROR((VLOOKUP(CONCATENATE(H17,I17),Qui!$D$301:$F$356,3,0)),0)","v":2},{"$nulls":7},2110,null,null,12,"Bühler","Raymond",64,0]
[{"$nulls":5},13,null,"Rossier","Yves-Alain",84,{"$f":"IFERROR((VLOOKUP(CONCATENATE(H18,I18),Qui!$D$301:$F$356,3,0)),0)","v":4},{"$nulls":7},2110,null,null,13,"Chassot","Yves-Alain",63,0]
[{"$nulls":5},14,null,"Jeanneret","Louis",83,{"$f":"IFERROR((VLOOKUP(CONCATENATE(H19,I19),Qui!$D$301:$F$356,3,0)),0)","v":2},{"$nulls":7},2110,null,null,14,"Rossier ","Yves-Alain",60,0]
[{"$nulls":4},{"$f":"VLOOKUP(B20,Qui!$A$201:$D$204,4)","v":{"$error":"#N/A"}},15,null,"Oppliger","Hervé",83,{"$f":"IFERROR((VLOOKUP(CONCATENATE(H20,I20),Qui!$D$301:$F$356,3,0)),0)","v":2},{"$nulls":7},2110,null,null,15,"Vuillème","Claude-Alain",60,0]
[{"$nulls":5},16,null,"Dick","Pierre-Alain",74,{"$f":"IFERROR((VLOOKUP(CONCATENATE(H21,I21),Qui!$D$301:$F$356,3,0)),0)","v":2},{"$nulls":10},16,"Oppliger","Hervé",57,0]
[{"$nulls":5},17,null,"Pellaton","Daniel",70,{"$f":"IFERROR((VLOOKUP(CONCATENATE(H22,I22),Qui!$D$301:$F$356,3,0)),0)","v":4},{"$nulls":10},17,"Pellaton","Daniel",54,0]
[{"$nulls":5},18,null,"Bühler","Raymond",67,{"$f":"IFERROR((VLOOKUP(CONCATENATE(H23,I23),Qui!$D$301:$F$356,3,0)),0)","v":0},{"$nulls":10},18,"Rollat","Christian",50,0]
[{"$nulls":5},19,null,"Dubois","Emmanuel",66,{"$f":"IFERROR((VLOOKUP(CONCATENATE(H24,I24),Qui!$D$301:$F$356,3,0)),0)","v":1},{"$nulls":10},19,"Aeschlimann","Louis",34,0]
[{"$nulls":5},20,null,"Rollat","Christian",62,{"$f":"IFERROR((VLOOKUP(CONCATENATE(H25,I25),Qui!$D$301:$F$356,3,0)),0)","v":1},{"$nulls":10},20,"Voirol","Pierre",34,0]
[{"$nulls":5},21,null,"Haussener","Philippe",58,{"$f":"IFERROR((VLOOKUP(CONCATENATE(H26,I26),Qui!$D$301:$F$356,3,0)),0)","v":2},{"$nulls":10},21,"Rindlisbacher","Heinz",21,0]
[{"$nulls":4},{"$f":"VLOOKUP(B27,Qui!$A$201:$D$204,4)","v":{"$error":"#N/A"}},22,null,"Bourquin","Willy",57,{"$f":"IFERROR((VLOOKUP(CONCATENATE(H27,I27),Qui!$D$301:$F$356,3,0)),0)","v":4},{"$nulls":10},22,"Matthey","Pierre",13,0]
[null,{"$f":"W18","v":"Chassot"},{"$f":"X18","v":"Yves-Alain"},null,null,23,null,"Dubois","Marcel",48,{"$f":"IFERROR((VLOOKUP(CONCATENATE(H28,I28),Qui!$D$301:$F$356,3,0)),0)","v":1},{"$nulls":10},23,"Dubois","Marcel",9,0]
[null,{"$f":"W19","v":"Rossier "},"Yves-Alain",null,null,24,null,"Matthey","Pierre",46,{"$f":"IFERROR((VLOOKUP(CONCATENATE(H29,I29),Qui!$D$301:$F$356,3,0)),0)","v":1},{"$nulls":10},24,"Billod-Morel","Gérald",0,0]
[null,{"$f":"W20","v":"Vuillème"},"Claude-Alain",null,null,25,null,"Coppey","Romain",41,{"$f":"IFERROR((VLOOKUP(CONCATENATE(H30,I30),Qui!$D$301:$F$356,3,0)),0)","v":0},{"$nulls":10},25,"Dubois","Eric",0,0]
[null,{"$f":"W21","v":"Oppliger"},"Hervé",null,null,26,null,"Aeschlimann","Louis",38,{"$f":"IFERROR((VLOOKUP(CONCATENATE(H31,I31),Qui!$D$301:$F$356,3,0)),0)","v":0},{"$nulls":10},26,"Jean-Mairet","Jean-Claude",0,0]
[null,null,"Total",null,null,27,null,"Jean-Mairet","Jean-Claude",22,{"$f":"IFERROR((VLOOKUP(CONCATENATE(H32,I32),Qui!$D$301:$F$356,3,0)),0)","v":1},{"$nulls":10},27,"Dubois","Emmanuel",0,0]
[{"$nulls":5},28,null,"Rindlisbacher","Heinz",12,{"$f":"IFERROR((VLOOKUP(CONCATENATE(H33,I33),Qui!$D$301:$F$356,3,0)),0)","v":4},{"$nulls":10},28,"Wäfler","Jean-Louis",0,0]
["5ème",{"$f":"IF($D39,(INDEX($Q$6:$S$20,MATCH($AA22,$Q$6:$Q$20,0),2)),0)","v":0},null,null,{"$f":"VLOOKUP(B34,Qui!$A$201:$D$204,4)","v":{"$error":"#N/A"}},29,{"$nulls":4},{"$f":"IFERROR((VLOOKUP(CONCATENATE(H34,I34),Qui!$D$301:$F$356,3,0)),0)","v":0},{"$nulls":10},29,"Reichen","Sylvain",0,0]
[null,{"$f":"W22","v":"Pellaton"},{"$f":"X22","v":"Daniel"},null,null,30,{"$nulls":4},{"$f":"IFERROR((VLOOKUP(CONCATENATE(H35,I35),Qui!$D$301:$F$356,3,0)),0)","v":0},{"$nulls":10},30,"Haussener","Philippe",0,0]
[null,{"$f":"W23","v":"Rollat"},"Christian",null,null,31,{"$nulls":4},{"$f":"IFERROR((VLOOKUP(CONCATENATE(H36,I36),Qui!$D$301:$F$356,3,0)),0)","v":0},{"$nulls":10},31,"Charlet","Léon",0,0]
[null,{"$f":"W24","v":"Aeschlimann"},"Louis",null,null,32,{"$nulls":4},{"$f":"IFERROR((VLOOKUP(CONCATENATE(H37,I37),Qui!$D$301:$F$356,3,0)),0)","v":0},{"$nulls":10},32,{"$nulls":3},0]
[null,{"$f":"W25","v":"Voirol"},"Pierre",null,null,33,{"$nulls":4},{"$f":"IFERROR((VLOOKUP(CONCATENATE(H38,I38),Qui!$D$301:$F$356,3,0)),0)","v":0},{"$nulls":10},33,{"$nulls":3},{"$f":"IF($AA38<>\"\",(IF($Y38,(INDEX($Q$6:$S$20,MATCH($AA38,$Q$6:$Q$20,0),3)),0)),0)","v":0}]
[null,null,"Total",null,null,34,{"$nulls":4},{"$f":"IFERROR((VLOOKUP(CONCATENATE(H39,I39),Qui!$D$301:$F$356,3,0)),0)","v":0},{"$nulls":10},34,{"$nulls":3},0]
[{"$nulls":5},35,{"$nulls":4},{"$f":"IFERROR((VLOOKUP(CONCATENATE(H40,I40),Qui!$D$301:$F$356,3,0)),0)","v":0},{"$nulls":10},35,{"$nulls":3},0]
["6ème",{"$f":"IF($D46,(INDEX($Q$6:$S$20,MATCH($AA26,$Q$6:$Q$20,0),2)),0)","v":0},null,null,{"$f":"VLOOKUP(B41,Qui!$A$201:$D$204,4)","v":{"$error":"#N/A"}},36,{"$nulls":15},36,{"$nulls":3},0]
[null,{"$f":"W26","v":"Rindlisbacher"},{"$f":"X26","v":"Heinz"},null,null,37,{"$nulls":15},37,{"$nulls":3},0]
[null,{"$f":"W27","v":"Matthey"},"Pierre",null,null,38,{"$nulls":15},38,{"$nulls":3},0]
[null,{"$f":"W28","v":"Dubois"},"Marcel",null,null,39,{"$nulls":15},39,{"$nulls":3},0]
[null,{"$f":"W29","v":"Billod-Morel"},"Gérald",null,null,40,{"$nulls":15},40,{"$nulls":3},0]
[{"$nulls":5},41,{"$nulls":15},41,{"$nulls":3},0]
[{"$nulls":5},42,{"$nulls":15},42,{"$nulls":3},0]
["7ème",{"$f":"IF($D53,(INDEX($Q$6:$S$20,MATCH($AA30,$Q$6:$Q$20,0),2)),0)","v":0},null,null,{"$f":"VLOOKUP(B48,Qui!$A$201:$D$204,4)","v":{"$error":"#N/A"}},43,{"$nulls":15},43,{"$nulls":3},0]
[null,{"$f":"W30","v":"Dubois"},{"$f":"X30","v":"Eric"},null,{"$f":"Z33","v":0},44,{"$nulls":15},44,{"$nulls":3},0]
[null,{"$f":"W31","v":"Jean-Mairet"},"Jean-Claude",null,null,45,{"$nulls":15},45,{"$nulls":3},0]
[null,{"$f":"W32","v":"Dubois"},"Emmanuel",null,null,46,{"$nulls":15},46,{"$nulls":3},0]
[null,{"$f":"W33","v":"Wäfler"},"Jean-Louis",null,null,47,{"$nulls":15},47,{"$nulls":3},0]
[{"$nulls":5},48,{"$nulls":15},48,{"$nulls":3},0]
["8ème",{"$f":"IF($D59,(INDEX($Q$6:$S$20,MATCH($AA34,$Q$6:$Q$20,0),2)),0)","v":0},null,null,{"$f":"VLOOKUP(B54,Qui!$A$201:$D$204,4)","v":{"$error":"#N/A"}},49,{"$nulls":15},49,{"$nulls":3},0]
[null,{"$f":"W34","v":"Reichen"},{"$f":"X34","v":"Sylvain"}]
[null,{"$f":"W35","v":"Haussener"},"Philippe",0]
[null,{"$f":"W36","v":"Charlet"},"Léon",0,{"$nulls":3},{"$f":"CONCATENATE(\"Champion de jeu : \",H6,\" \",I6)","v":"Champion de jeu : Tynowski Lucien"},null,{"$f":"J6","v":121}]
[null,{"$f":"W37","v":0},0,0]
[{"$nulls":3},{"$f":"SUM(D55:D58)","v":0},{"$nulls":5},"La Chaux-de-Fonds, le 4 avril 2020, cm"]

{"sheet":"Challenge_GJ","index":12,"n_rows":84,"n_cols":37,"rows_kept":84,"hidden":true,"merged":[[0,0,0,9],[1,0,1,9],[3,16,3,18],[3,21,3,26],[3,28,3,30],[56,7,56,8]]}
["Association intercantonale\n des joueurs de boules,\nGrand Jeu Neuchâtelois\n"]
[{"$f":"CONCATENATE(Calendrier!A11,\"      Jeu : \",(Calendrier!F11))","v":"Challenge -  ÉTÉ (ex Impartial)      Jeu : La  Chaux-de-Fonds"}]
[{"$nulls":9},{"$f":"CONCATENATE(\"du\",TEXT(Calendrier!F13,\" jj.mm\"),\" au\",TEXT(Calendrier!F16,\" jj.mm.aaaa\"))","v":"du 22.04 au 25.04.2024"}]
["Classement par équipes",{"$nulls":6},"Classement individuel",{"$nulls":4},"Club",{"$nulls":3},"Clubs possibles",{"$nulls":4},"Equipes triées (RE_xx)",{"$nulls":6},"Clubs tri"]
[{"$nulls":16},"N°","Nom","Total club",null,null,"Rang","Nom","Prénom","Résultat","Total Club","Club",null,"N°","Nom","Total club"]
["1er",{"$f":"IF($D12,(INDEX($Q$6:$S$20,MATCH($AA6,$Q$6:$Q$20,0),2)),0)","v":"Le Locle"},null,null,{"$f":"VLOOKUP(B6,Qui!$A$201:$D$204,4)","v":3},1,null,"Mores","Blaise",103,{"$f":"IFERROR((VLOOKUP(CONCATENATE(H6,I6),Q_NP_ClNom_ClNo,3,0)),0)","v":4},null,{"$f":"K6","v":4},{"$nulls":3},{"$f":"Qui!D201","v":1},{"$f":"Qui!F201","v":"La Chaux-de-Fonds"},{"$f":"SUMPRODUCT(LARGE((CI_NoClub=$Q6)*(CI_Resultat),{1;2;3;4;5}))","v":205},null,null,1,"Tynowski","Lucien",101,{"$f":"IF($AA6<>\"\",(IF($Y6,(INDEX($Q$6:$S$20,MATCH($AA6,$Q$6:$Q$20,0),3)),0)),0)","v":464},3,null,4,"L'Epi",444,{"$f":"LARGE(RE_TotClub,1)","v":464},{"$f":"LARGE(RE_TotClub,2)","v":464},{"$f":"LARGE(RE_TotClub,3)","v":464},{"$f":"LARGE(RE_TotClub,4)","v":464},null,{"$f":"INDEX(RE_TotClub,$AE$6,1)","v":{"$error":"#REF!"}}]
[null,{"$f":"W6","v":"Tynowski"},{"$f":"X6","v":"Lucien"},101,null,2,null,"Tynowski","Lucien",101,3,null,3,{"$nulls":3},{"$f":"Qui!D202","v":2},{"$f":"Qui!F202","v":"La Vue-des-Alpes"},{"$f":"SUMPRODUCT(LARGE((CI_NoClub=$Q7)*(CI_Resultat),{1;2;3;4;5}))","v":327},null,null,2,"Favre","Daniel",100,464,3,null,3,"Le Locle",333,{"$f":"IF((LARGE(RE_TotClub,1)<AE$6),\"qqq\",(LARGE(RE_TotClub,1)<AE$6))","v":false},{"$f":"LARGE(RE_TotClub,2)","v":464},{"$f":"LARGE(RE_TotClub,3)","v":464},{"$f":"LARGE(RE_TotClub,4)","v":464}]
[null,{"$f":"W7","v":"Favre"},"Daniel",100,null,3,null,"Favre","Daniel",100,3,null,3,{"$nulls":3},{"$f":"Qui!D203","v":3},{"$f":"Qui!F203","v":"Le Locle"},{"$f":"SUMPRODUCT(LARGE((CI_NoClub=$Q8)*(CI_Resultat),{1;2;3;4;5}))","v":464},null,null,3,"Bart","Fabien",93,464,3,null,2,"La Vue-des-Alpes",223]
[null,{"$f":"W8","v":"Bart"},"Fabien",93,null,4,null,"Monnier","Christian",99,1,null,1,{"$nulls":3},{"$f":"Qui!D204","v":4},{"$f":"Qui!F204","v":"L'Epi"},{"$f":"SUMPRODUCT(LARGE((CI_NoClub=$Q9)*(CI_Resultat),{1;2;3;4;5}))","v":366},null,null,4,"Kemajl","Fetahi",92,464,3,null,1,"La Chaux-de-Fonds",111]
[null,{"$f":"W9","v":"Kemajl"},{"$f":"X9","v":"Fetahi"},{"$f":"Y9","v":92},null,5,null,"Bart","Fabien",93,3,null,3,{"$nulls":3},{"$f":"Qui!D205","v":5},{"$f":"Qui!F205","v":0},{"$f":"SUMPRODUCT(LARGE((CI_NoClub=$Q10)*(CI_Resultat),{1;2;3;4;5}))","v":0},null,null,5,"Cassi","Alain",78,464,3,null,5,0,0]
[null,{"$f":"W10","v":"Cassi"},{"$f":"X10","v":"Alain"},{"$f":"Y10","v":78},null,6,null,"Kemajl","Fetahi",92,3,null,3,{"$nulls":5},{"$f":"SUMIF($M$6:$M$40,\"=\"&$Q11,$J$6:$J$40)","v":0},null,null,6,"Mores","Blaise",103,366,4,{"$nulls":3},0]
[null,null,"Total",{"$f":"SUM(D7:D11)","v":464},null,7,null,"Bourquin","Willy",80,4,null,4,{"$nulls":5},{"$f":"SUMIF($M$6:$M$40,\"=\"&$Q12,$J$6:$J$40)","v":0},null,null,7,"Bourquin","Willy",80,366,4,{"$nulls":3},0]
[{"$nulls":5},8,null,"Cassi","Alain",78,3,null,3,{"$nulls":8},8,"Frutiger","Bertrand",69,366,4]
["2ème",{"$f":"IF($D20,(INDEX($Q$6:$S$20,MATCH($AA10,$Q$6:$Q$20,0),2)),0)","v":"Le Locle"},null,null,{"$f":"VLOOKUP(B14,Qui!$A$201:$D$204,4)","v":3},9,null,"Dick","Pierre-Alain",75,2,null,2,{"$nulls":8},9,"Bühler","Raymond",64,366,4]
[null,{"$f":"W10","v":"Cassi"},"Alain",78,null,10,null,"Jeanneret","Louis",72,2,null,2,{"$nulls":8},10,"Rossier","Yves-Alain",60,366,4]
[null,"Mores","Blaise",103,null,11,null,"Frutiger","Bertrand",69,4,null,4,{"$nulls":8},11,"Pellaton","Daniel",54,366,4]
[null,"Bourquin","Willy",80,null,12,null,"Bühler","Raymond",64,0,null,0,{"$nulls":8},12,"Aeschlimann","Loris",34,366,4]
[null,"Frutiger","Bertrand",69,null,13,null,"Chassot","Yves",63,2,null,2,{"$nulls":8},13,"Rindlisbacher","Heinz",21,366,4]
[null,{"$f":"W13","v":"Frutiger"},{"$f":"X13","v":"Bertrand"},{"$f":"Y13","v":69},null,14,null,"Rossier","Yves-Alain",60,4,null,4,{"$nulls":8},14,"Dick","Pierre-Alain",75,327,2]
[null,null,"Total",{"$f":"SUM(D15:D19)","v":399},null,15,null,"Vuillème","Claude-Alain",60,2,null,2,{"$nulls":8},15,"Jeanneret","Louis",72,327,2]
[{"$nulls":5},16,null,"Oppliger","Hervé",57,2,null,2,{"$nulls":8},16,"Chassot","Yves",63,327,2]
["3ème",{"$f":"IF($D28,(INDEX($Q$6:$S$20,MATCH($AA14,$Q$6:$Q$20,0),2)),0)","v":"L'Epi"},null,null,{"$f":"VLOOKUP(B22,Qui!$A$201:$D$204,4)","v":4},17,null,"Pellaton","Daniel",54,4,null,4,{"$nulls":8},17,"Vuillème","Claude-Alain",60,327,2]
[null,{"$f":"W14","v":"Bühler"},"Raymond",64,null,18,null,"Rollat","Christian",50,1,null,1,{"$nulls":8},18,"Oppliger","Hervé",57,327,2]
[null,"Rossier","Yves-Alain",60,null,19,null,"Aeschlimann","Loris",34,4,null,4,{"$nulls":8},19,"Monnier","Christian",99,205,1]
[null,"Pellaton","Daniel",54,null,20,null,"Voirol","Pierre",34,1,null,1,{"$nulls":8},20,"Rollat","Christian",50,205,1]
[null,"Aeschlimann","Loris",34,null,21,null,"Rindlisbacher","Heinz",21,4,null,4,{"$nulls":8},21,"Voirol","Pierre",34,205,1]
[null,{"$f":"W17","v":"Aeschlimann"},{"$f":"X17","v":"Loris"},{"$f":"Y17","v":34},null,22,null,"Matthey","Pierre",13,1,null,1,{"$nulls":8},22,"Matthey","Pierre",13,205,1]
[{"$nulls":3},{"$f":"SUM(D23:D27)","v":246},null,23,null,"Dubois","Marcel",9,1,null,1,{"$nulls":8},23,"Dubois","Marcel",9,205,1]
[{"$nulls":5},24,null,"Billod-Morel","Gérald",0,1,null,1,{"$nulls":8},24,"Billod-Morel","Gérald",0,0,1]
["4ème",{"$f":"IF($D36,(INDEX($Q$6:$S$20,MATCH($AA18,$Q$6:$Q$20,0),2)),0)","v":"L'Epi"},null,null,{"$f":"VLOOKUP(B30,Qui!$A$201:$D$204,4)","v":4},25,null,"Dubois","Eric",0,1,null,1,{"$nulls":8},25,"Dubois","Eric",0,0,1]
[null,{"$f":"W18","v":"Rindlisbacher"},"Heinz",21,null,26,null,"Jean-Mairet","Jean-Claude",0,1,null,1,{"$nulls":8},26,"Jean-Mairet","Jean-Claude",0,0,1]
[null,"Dick","Pierre-Alain",75,null,27,null,"Dubois","Emmanuel",0,1,null,1,{"$nulls":8},27,"Dubois","Emmanuel",0,0,1]
[null,"Jeanneret","Louis",72,null,28,null,"Wäfler","Jean-Louis",0,4,null,4,{"$nulls":8},28,"Wäfler","Jean-Louis",0,0,4]
[null,"Chassot","Yves",63,null,29,null,"Reichen","Sylvain",0,4,null,4,{"$nulls":8},29,"Reichen","Sylvain",0,0,4]
[null,{"$f":"W21","v":"Chassot"},{"$f":"X21","v":"Yves"},{"$f":"Y21","v":63},null,30,null,"Haussener","Philippe",0,2,null,2,{"$nulls":8},30,"Haussener","Philippe",0,0,2]
[null,null,"Total",{"$f":"SUM(D31:D35)","v":294},null,31,{"$nulls":4},0,null,0,{"$nulls":8},31,{"$nulls":3},0,0]
[{"$nulls":5},32,{"$nulls":4},0,null,0,{"$nulls":8},32,{"$nulls":3},0,0]
["5ème",{"$f":"IF($D43,(INDEX($Q$6:$S$20,MATCH($AA22,$Q$6:$Q$20,0),2)),0)","v":"La Vue-des-Alpes"},null,null,{"$f":"VLOOKUP(B38,Qui!$A$201:$D$204,4)","v":2},33,{"$nulls":4},{"$f":"IFERROR((VLOOKUP(CONCATENATE(H38,I38),Q_NP_ClNom_ClNo,3,0)),0)","v":0},null,0,{"$nulls":8},33,{"$nulls":3},{"$f":"IF($AA38<>\"\",(IF($Y38,(INDEX($Q$6:$S$20,MATCH($AA38,$Q$6:$Q$20,0),3)),0)),0)","v":0},0]
[null,{"$f":"W22","v":"Vuillème"},"Claude-Alain",60,null,34,{"$nulls":4},0,{"$nulls":10},34,{"$nulls":3},0,0]
[null,"Oppliger","Hervé",57,null,35,{"$nulls":4},0,{"$nulls":10},35,{"$nulls":3},0,0]
[null,"Monnier","Christian",99,null,36,{"$nulls":4},0,{"$nulls":10},36,{"$nulls":3},0,0]
[null,"Rollat","Christian",50,null,37,{"$nulls":4},0,{"$nulls":10},37,{"$nulls":3},0,0]
[null,null,"Total",{"$f":"SUM(D39:D42)","v":266},null,38,{"$nulls":4},0,{"$nulls":10},38,{"$nulls":3},0,0]
[{"$nulls":5},39,{"$nulls":4},0,{"$nulls":10},39,{"$nulls":3},0,0]
["6ème",{"$f":"IF($D51,(INDEX($Q$6:$S$20,MATCH($AA26,$Q$6:$Q$20,0),2)),0)","v":"La Chaux-de-Fonds"},null,null,{"$f":"VLOOKUP(B45,Qui!$A$201:$D$204,4)","v":1},40,{"$nulls":4},0,{"$nulls":10},40,{"$nulls":3},0,0]
[null,{"$f":"W26","v":"Voirol"},"Pierre",34,null,41,{"$nulls":4},0,{"$nulls":10},41,{"$nulls":3},0,0]
[null,"Matthey","Pierre",13,null,42,{"$nulls":4},0,{"$nulls":10},42,{"$nulls":3},0,0]
[null,"Dubois","Marcel",9,null,43,{"$nulls":4},0,{"$nulls":10},43,{"$nulls":3},0,0]
[null,"Billod-Morel","Gérald",0,null,44,{"$nulls":4},0,{"$nulls":10},44,{"$nulls":3},0,0]
[null,{"$f":"W29","v":"Billod-Morel"},{"$f":"X29","v":"Gérald"},{"$f":"Y29","v":0},null,45,{"$nulls":4},0,{"$nulls":10},45,{"$nulls":3},0,0]
[{"$nulls":3},{"$f":"SUM(D46:D50)","v":56},null,46,{"$nulls":4},0,{"$nulls":10},46,{"$nulls":3},0,0]
[{"$nulls":5},47,{"$nulls":4},0,{"$nulls":10},47,{"$nulls":3},0,0]
[{"$nulls":5},48,{"$nulls":4},0,{"$nulls":10},48,{"$nulls":3},0,0]
[{"$nulls":5},49,{"$nulls":4},0,{"$nulls":10},49,{"$nulls":3},0,0]
[]
[]
[{"$nulls":7},{"$f":"CONCATENATE(\"Champion de jeu : \",H6,\" \",I6)","v":"Champion de jeu : Mores Blaise"},null,{"$f":"J6","v":103}]
[]
[{"$nulls":9},"La Chaux-de-Fonds, le 4 avril 2020, cm"]
[]
[]
[{"$nulls":17},"Résultat club"]
[{"$nulls":17},{"$f":"LARGE($S$6:$S$12,1)","v":464}]
[{"$nulls":17},{"$f":"LARGE($S$6:$S$12,2)","v":366}]
[{"$nulls":17},{"$f":"LARGE($S$6:$S$12,3)","v":327}]
[{"$nulls":17},{"$f":"LARGE($S$6:$S$12,4)","v":205}]
[{"$nulls":17},{"$f":"LARGE($S$6:$S$12,5)","v":0}]
[]
[]
[]
[]
[{"$nulls":17},{"$f":"IF(ROW()=1,#REF!,INDEX($A$2:$A$100,(ROW()-2)*5+5))","v":{"$error":"#REF!"}}]
[{"$nulls":17},{"$f":"INDEX(L63:P111,7,2)","v":0}]
[{"$nulls":17},{"$f":"IF(ROWS(#REF!)>$B$3,\"\",INDEX(#REF!,SMALL(IF((#REF!>=$B$1)*(#REF!<=$B$2),ROW(#REF!)-ROW(#REF!)+1),ROWS(#REF!))))","v":{"$error":"#REF!"}}]
[{"$nulls":17},{"$f":"LARGE(O63:O111,3)","v":{"$error":"#NUM!"}},{"$f":"VLOOKUP(#REF!,$Z$6:$Z$54,1,0)","v":{"$error":"#REF!"}},{"$f":"VLOOKUP(#REF!,$Z$6:$Z$54,1,0)","v":{"$error":"#REF!"}}]
[{"$nulls":17},{"$f":"INDEX(L63:N71, 3,2)","v":0},{"$f":"VLOOKUP(#REF!,$Z$6:$Z$54,1,0)","v":{"$error":"#REF!"}},{"$f":"VLOOKUP(#REF!,$Z$6:$Z$54,1,0)","v":{"$error":"#REF!"}}]
[{"$nulls":18},{"$f":"VLOOKUP(#REF!,$Z$6:$Z$54,1,0)","v":{"$error":"#REF!"}},{"$f":"VLOOKUP(#REF!,$Z$6:$Z$54,1,0)","v":{"$error":"#REF!"}}]
[{"$nulls":18},{"$f":"VLOOKUP(#REF!,$Z$6:$Z$54,1,0)","v":{"$error":"#REF!"}},{"$f":"VLOOKUP(#REF!,$Z$6:$Z$54,1,0)","v":{"$error":"#REF!"}}]
[{"$nulls":18},{"$f":"VLOOKUP(#REF!,$Z$6:$Z$54,1,0)","v":{"$error":"#REF!"}},{"$f":"VLOOKUP(#REF!,$Z$6:$Z$54,1,0)","v":{"$error":"#REF!"}}]
[{"$nulls":18},{"$f":"VLOOKUP(#REF!,$Z$6:$Z$54,1,0)","v":{"$error":"#REF!"}},{"$f":"VLOOKUP(#REF!,$Z$6:$Z$54,1,0)","v":{"$error":"#REF!"}}]
[{"$nulls":18},{"$f":"VLOOKUP(#REF!,$Z$6:$Z$54,1,0)","v":{"$error":"#REF!"}},{"$f":"VLOOKUP(#REF!,$Z$6:$Z$54,1,0)","v":{"$error":"#REF!"}}]
[]
[]
[{"$nulls":17},{"$f":"INDEX($Z$6:$Z$54,MIN(IF(COUNTIF(#REF!,$Z$6:$Z$54),ROW(O$54)-ROW()+1,ROW($Z$6:$Z$54)-ROW()+1)))","v":{"$error":"#REF!"}}]

{"sheet":"Champions_AN","index":13,"n_rows":42,"n_cols":5,"rows_kept":42,"hidden":true,"merged":[[0,0,0,4],[1,1,1,4]]}
["Association intercantonale \ndes joueurs de boules\nGrand Jeu Neuchâtelois"]
[null,{"$f":"CONCATENATE(\"Récapitulatif pour l'année   \",YEAR(Calendrier!B6))","v":"Récapitulatif pour l'année   2024"}]
[]
[]
[]
[null,{"$f":"Calendrier!A4","v":"Challenge 80ème"},{"$f":"Calendrier!F4","v":"L'Epi"},{"$f":"Challenge_1!H57","v":"Champion de jeu : Reichen Sylvain"},{"$f":"Challenge_1!J57","v":115}]
[null,null,{"$f":"Challenge_1!J3","v":"du  18.03 au  21.03.2024"},{"$f":"CONCATENATE(\"Par équipe : \",(Challenge_1!$B$6))","v":"Par équipe : L'Epi I"},{"$f":"Challenge_1!D11","v":414}]
[]
[null,{"$f":"Calendrier!A25","v":"Challenge -  ÉTÉ (ex Impartial)"},{"$f":"Calendrier!F25","v":0},{"$f":"Challenge_2!H42","v":0},{"$f":"Challenge_2!J42","v":0}]
[null,null,{"$f":"Challenge_2!J3","v":"du  08.05 au  11.05.2023"},{"$f":"CONCATENATE(\"Par équipe : \",(Challenge_2!$B$6))","v":"Par équipe : La Chaux-de-Fonds"},{"$f":"Challenge_2!D11","v":0}]
[]
[null,{"$f":"Calendrier!A11","v":"Challenge -  ÉTÉ (ex Impartial)"},{"$f":"Calendrier!F11","v":"La  Chaux-de-Fonds"},null,{"$f":"Manche_1!$R$5","v":118}]
[]
[]
[null,{"$f":"Calendrier!A18","v":"COUPE SUISSE"},{"$f":"Calendrier!F18","v":"Evologia"}]
[null,null,{"$f":"Calendrier!F23","v":"2024-06-29"}]
[]
[]
[null,{"$f":"Calendrier!A40","v":"Championnat 1ère manche"},{"$f":"Calendrier!F40","v":"Grand-Sommartel"},{"$f":"Manche_1!$P$4","v":"Champion de jeu : \nBart Fabien"},{"$f":"Manche_1!$R$5","v":118}]
[null,null,{"$f":"Manche_1!U3","v":" 26.08 au 29.08.2024"},{"$f":"CONCATENATE(\"Par équipe : \",(Manche_1!$P$62))","v":"Par équipe : La Vue-des-Alpes"},{"$f":"Manche_1!$R$62","v":480}]
[]
[null,{"$f":"Calendrier!A47","v":"Championnat 2ème manche"},{"$f":"Calendrier!F47","v":"Le Locle"},{"$f":"Manche_2!$P$4","v":"Champion de jeu : \nBart Fabien"},{"$f":"Manche_2!$R$5","v":109}]
[null,null,{"$f":"Manche_2!U3","v":" 09.09 au 12.09.2024"},{"$f":"CONCATENATE(\"Par équipe : \",(Manche_2!$P$62))","v":"Par équipe : La Vue-des-Alpes"},{"$f":"Manche_2!$R$62","v":0}]
[]
[null,{"$f":"Calendrier!A54","v":"Championnat 3ème manche"},{"$f":"Calendrier!F54","v":"Evologia"},{"$f":"Manche_3!$P$4","v":"Champion de jeu : \n "},{"$f":"Manche_3!$R$5","v":0}]
[null,null,{"$f":"Manche_3!U3","v":" 30.09 au 03.10.2024"},{"$f":"CONCATENATE(\"Par équipe : \",(Manche_3!$P$62))","v":"Par équipe : "},{"$f":"Manche_3!$R$62","v":0}]
[]
[null,{"$f":"Calendrier!A61","v":"Championnat 4ème manche"},{"$f":"Calendrier!F61","v":"La  Vue-des-Alpes"},{"$f":"Manche_4!$P$4","v":"Champion de jeu : \n "},{"$f":"Manche_4!$R$5","v":0}]
[null,null,{"$f":"Manche_4!U3","v":" 28.10 au 31.10.2024"},{"$f":"CONCATENATE(\"Par équipe : \",(Manche_4!$P$62))","v":"Par équipe : "},{"$f":"Manche_4!$R$62","v":0}]
[]
[null,{"$f":"Calendrier!A68","v":"Championnat 5ème manche"},{"$f":"Calendrier!F68","v":"L'Epi"},{"$f":"Manche_5!$P$4","v":"Champion de jeu : \n "},{"$f":"Manche_5!$R$5","v":0}]
[null,null,{"$f":"Manche_5!U3","v":" 11.11 au 14.11.2024"},{"$f":"CONCATENATE(\"Par équipe : \",(Manche_5!$P$62))","v":"Par équipe : "},{"$f":"Manche_5!$R$62","v":0}]
[]
[null,{"$f":"Calendrier!A75","v":"Championnat 6ème manche"},{"$f":"Calendrier!F75","v":"La  Chaux-de-Fonds"},{"$f":"Manche_6!$P$4","v":"Champion de jeu : \n "},{"$f":"Manche_6!$R$5","v":0}]
[null,null,{"$f":"Manche_6!U3","v":" 25.11 au 28.11.2024"},{"$f":"CONCATENATE(\"Par équipe : \",(Manche_6!$P$62))","v":"Par équipe : "},{"$f":"Manche_6!$R$62","v":0}]
[]
[null,{"$f":"Calendrier!A82","v":0},null,{"$f":"Manche_7!$P$4","v":"Champion de jeu : \n "},{"$f":"Manche_7!$R$5","v":0}]
[null,{"$f":"Calendrier!F82","v":0},null,{"$f":"CONCATENATE(\"Par équipe : \",(Manche_7!$P$62))","v":"Par équipe : "},{"$f":"Manche_7!$R$62","v":0}]
[]
[]
[null,"Classement général",null,{"$f":"CONCATENATE(\"Champion des jeux : \",Manche_7!$B$5,\" \",Manche_7!$C$5)","v":"Champion des jeux :  "},{"$f":"Manche_7!$M$5","v":{"$error":"#NUM!"}}]
[{"$nulls":3},{"$f":"CONCATENATE(\"Par équipe : \",Manche_7!$B$62)","v":"Par équipe : "},{"$f":"Manche_7!$M$62","v":{"$error":"#NUM!"}}]

{"sheet":"A Ameliorer","index":14,"n_rows":14,"n_cols":5,"rows_kept":14,"hidden":true}
["Date","Qui","Accepté","Réalisé ","Quoi"]
["2019-09-01","Daniel",null,"2020-02-02","Mentionner la date d'arrivée dans l'Intercantonale pour chaque joueur ==> jubilaire"]
["2019-09-01","Daniel",null,"2020-02-02","Mentionner la date de naissance pour chaque joueur ==> sympa"]
["2019-09-01","Daniel","2020-04-09",null,"Intégrer toutes les compétitions"]
["2019-10-31","Daniel",null,"2019-12-31","Interdiction de relancer Tri si déjà fait"]
["2019-09-17","Daniel",null,"2019-09-17","Affichage des chiffres à virgule ==> suppression des décimales "]
["2019-09-17","Daniel",null,"2019-09-17","Addition totaux équipe manche 2"]
["2019-10-09","Daniel",null,"2019-10-09","Interdiction de relancer Préparationi déjà fait"]
[]
[]
[null,null,"2020-04-09",null,"Intégrer coupe suisse"]
[null,null,"2020-04-10",null,"Intégrer challenge 70ème"]
[]
["2020-07-07","Daniel",null,"2020-07-07","Détection de scores identiques et mise en évidence"]